BDBM52061 MLS000035396::SMR000015030::cid_647139
SMILES CC1=CC(C)(C)N2C(=O)C3(c4c2c1cc(C)c4C)C(C#N)=C(N)OC1=C3C(=O)CCC1
InChI Key InChIKey=OQPKDMUZOXBYHT-UHFFFAOYSA-N
Data  2 EC50
  Tab Delimited (TSV)   2D SDfile   Computed 3D by Vconf -m prep SDfile
Find this compound or compounds like it in BindingDB:
Activity Spreadsheet -- Enzyme Inhibition Constant Data from BindingDB
Found 2 hits for monomerid = 52061
TargetZinc finger protein mex-5(Caenorhabditis elegans)
Broad Institute
Curated by PubChem BioAssay
LigandPNGBDBM52061(MLS000035396 | SMR000015030 | cid_647139)
Affinity DataEC50:  3.00E+5nM. Assay description: Broad Institute: MLPCN maternal gene expression Project ID: 2024 Keywords: Zinc finger, C. elegans, maternal gene expression, RNA-protein interac...
In DepthDetails PCBioAssay
TargetPOsterior Segregation(Caenorhabditis elegans)
Broad Institute
Curated by PubChem BioAssay
LigandPNGBDBM52061(MLS000035396 | SMR000015030 | cid_647139)
Affinity DataEC50:  3.00E+5nM. Assay description: Broad Institute: MLPCN maternal gene expression Project ID: 2024 Keywords: Zinc finger, C. elegans, maternal gene expression, RNA-protein interac...
In DepthDetails PCBioAssay