BDBM52101 (5E)-1-(2-furfuryl)-5-[[(3-keto-1,5-dimethyl-2-phenyl-3-pyrazolin-4-yl)amino]methylene]barbituric acid::(5E)-5-[[(1,5-dimethyl-3-oxidanylidene-2-phenyl-pyrazol-4-yl)amino]methylidene]-1-(furan-2-ylmethyl)-1,3-diazinane-2,4,6-trione::(5E)-5-[[(1,5-dimethyl-3-oxo-2-phenyl-4-pyrazolyl)amino]methylidene]-1-(2-furanylmethyl)-1,3-diazinane-2,4,6-trione::(5E)-5-[[(1,5-dimethyl-3-oxo-2-phenylpyrazol-4-yl)amino]methylidene]-1-(furan-2-ylmethyl)-1,3-diazinane-2,4,6-trione::MLS000078038::SMR000040819::cid_5389190
SMILES Cc1c(NC=C2C(=O)NC(=O)N(Cc3ccco3)C2=O)c(=O)n(-c2ccccc2)n1C
InChI Key InChIKey=QZQXPZOXGBADOG-UHFFFAOYSA-N
Data  2 EC50
  Tab Delimited (TSV)   2D SDfile   Computed 3D by Vconf -m prep SDfile
Find this compound or compounds like it in BindingDB:
Activity Spreadsheet -- Enzyme Inhibition Constant Data from BindingDB
Found 2 hits for monomerid = 52101
TargetZinc finger protein mex-5(Caenorhabditis elegans)
Broad Institute
Curated by PubChem BioAssay
LigandPNGBDBM52101((5E)-1-(2-furfuryl)-5-[[(3-keto-1,5-dimethyl-2-phe...)
Affinity DataEC50:  3.00E+5nM. Assay description: Broad Institute: MLPCN maternal gene expression Project ID: 2024 Keywords: Zinc finger, C. elegans, maternal gene expression, RNA-protein interac...
In DepthDetails PCBioAssay
TargetPOsterior Segregation(Caenorhabditis elegans)
Broad Institute
Curated by PubChem BioAssay
LigandPNGBDBM52101((5E)-1-(2-furfuryl)-5-[[(3-keto-1,5-dimethyl-2-phe...)
Affinity DataEC50:  3.00E+5nM. Assay description: Broad Institute: MLPCN maternal gene expression Project ID: 2024 Keywords: Zinc finger, C. elegans, maternal gene expression, RNA-protein interac...
In DepthDetails PCBioAssay