BDBM52133 (5E)-1-benzyl-5-[[4-(morpholin-4-ylmethyl)anilino]methylidene]-1,3-diazinane-2,4,6-trione::(5E)-1-benzyl-5-[[4-(morpholinomethyl)anilino]methylene]barbituric acid::(5E)-5-[[4-(4-morpholinylmethyl)anilino]methylidene]-1-(phenylmethyl)-1,3-diazinane-2,4,6-trione::(5E)-5-[[[4-(morpholin-4-ylmethyl)phenyl]amino]methylidene]-1-(phenylmethyl)-1,3-diazinane-2,4,6-trione::MLS000041642::SMR000046233::cid_5389928
SMILES O=C1NC(=O)C(=CNc2ccc(CN3CCOCC3)cc2)C(=O)N1Cc1ccccc1
InChI Key InChIKey=XPPNZOBEJLLGSI-UHFFFAOYSA-N
Data  2 EC50
  Tab Delimited (TSV)   2D SDfile   Computed 3D by Vconf -m prep SDfile
Find this compound or compounds like it in BindingDB:
Activity Spreadsheet -- Enzyme Inhibition Constant Data from BindingDB
Found 2 hits for monomerid = 52133
TargetZinc finger protein mex-5(Caenorhabditis elegans)
Broad Institute
Curated by PubChem BioAssay
LigandPNGBDBM52133((5E)-1-benzyl-5-[[4-(morpholin-4-ylmethyl)anilino]...)
Affinity DataEC50:  3.00E+5nM. Assay description: Broad Institute: MLPCN maternal gene expression Project ID: 2024 Keywords: Zinc finger, C. elegans, maternal gene expression, RNA-protein interac...
In DepthDetails PCBioAssay
TargetPOsterior Segregation(Caenorhabditis elegans)
Broad Institute
Curated by PubChem BioAssay
LigandPNGBDBM52133((5E)-1-benzyl-5-[[4-(morpholin-4-ylmethyl)anilino]...)
Affinity DataEC50:  3.00E+5nM. Assay description: Broad Institute: MLPCN maternal gene expression Project ID: 2024 Keywords: Zinc finger, C. elegans, maternal gene expression, RNA-protein interac...
In DepthDetails PCBioAssay