BDBM52144 (E)-3-amino-2-(2-quinazolin-4-ylsulfanylacetyl)but-2-enenitrile::(E)-3-amino-2-[1-oxo-2-(4-quinazolinylthio)ethyl]-2-butenenitrile::(E)-3-amino-2-[2-(quinazolin-4-ylthio)acetyl]but-2-enenitrile::(E)-3-azanyl-2-(2-quinazolin-4-ylsulfanylethanoyl)but-2-enenitrile::MLS000057378::SMR000068733::cid_5742504
SMILES CC(=N)C(C#N)C(=O)CSc1ncnc2ccccc12
InChI Key InChIKey=VZLHRDMXROJBIE-UHFFFAOYSA-N
Data  2 EC50
  Tab Delimited (TSV)   2D SDfile   Computed 3D by Vconf -m prep SDfile
Find this compound or compounds like it in BindingDB:
Activity Spreadsheet -- Enzyme Inhibition Constant Data from BindingDB
Found 2 hits for monomerid = 52144
TargetZinc finger protein mex-5(Caenorhabditis elegans)
Broad Institute
Curated by PubChem BioAssay
LigandPNGBDBM52144((E)-3-amino-2-(2-quinazolin-4-ylsulfanylacetyl)but...)
Affinity DataEC50:  8.02E+3nM. Assay description: Broad Institute: MLPCN maternal gene expression Project ID: 2024 Keywords: Zinc finger, C. elegans, maternal gene expression, RNA-protein interac...
In DepthDetails PCBioAssay
TargetPOsterior Segregation(Caenorhabditis elegans)
Broad Institute
Curated by PubChem BioAssay
LigandPNGBDBM52144((E)-3-amino-2-(2-quinazolin-4-ylsulfanylacetyl)but...)
Affinity DataEC50:  3.00E+5nM. Assay description: Broad Institute: MLPCN maternal gene expression Project ID: 2024 Keywords: Zinc finger, C. elegans, maternal gene expression, RNA-protein interac...
In DepthDetails PCBioAssay