BDBM52234 6-Amino-2-ethyl-8-(2-trifluoromethyl-phenyl)-2,6,8,8a-tetrahydro-1H-isoquinoline-5,7,7-tricarbonitrile::6-amino-2-ethyl-8-[2-(trifluoromethyl)phenyl]-1,6,8,8a-tetrahydroisoquinoline-5,7,7-tricarbonitrile::6-azanyl-2-ethyl-8-[2-(trifluoromethyl)phenyl]-1,6,8,8a-tetrahydroisoquinoline-5,7,7-tricarbonitrile::MLS000527680::SMR000120254::cid_3156453
SMILES CCN1CC2C(c3ccccc3C(F)(F)F)C(C#N)(C#N)C(N)C(C#N)=C2C=C1
InChI Key InChIKey=RVFTYZUZLXPIGM-UHFFFAOYSA-N
Data  2 EC50
  Tab Delimited (TSV)   2D SDfile   Computed 3D by Vconf -m prep SDfile
Find this compound or compounds like it in BindingDB:
Activity Spreadsheet -- Enzyme Inhibition Constant Data from BindingDB
Found 2 hits for monomerid = 52234
TargetZinc finger protein mex-5(Caenorhabditis elegans)
Broad Institute
Curated by PubChem BioAssay
LigandPNGBDBM52234(6-Amino-2-ethyl-8-(2-trifluoromethyl-phenyl)-2,6,8...)
Affinity DataEC50:  3.00E+5nM. Assay description: Broad Institute: MLPCN maternal gene expression Project ID: 2024 Keywords: Zinc finger, C. elegans, maternal gene expression, RNA-protein interac...
In DepthDetails PCBioAssay
TargetPOsterior Segregation(Caenorhabditis elegans)
Broad Institute
Curated by PubChem BioAssay
LigandPNGBDBM52234(6-Amino-2-ethyl-8-(2-trifluoromethyl-phenyl)-2,6,8...)
Affinity DataEC50:  2.60E+5nM. Assay description: Broad Institute: MLPCN maternal gene expression Project ID: 2024 Keywords: Zinc finger, C. elegans, maternal gene expression, RNA-protein interac...
In DepthDetails PCBioAssay