BDBM52247 4-(3-methoxy-4-propan-2-yloxyphenyl)-6-methyl-2-sulfanylidene-3,4-dihydro-1H-pyrimidine-5-carboxylic acid propan-2-yl ester::4-(4-isopropoxy-3-methoxy-phenyl)-6-methyl-2-thioxo-3,4-dihydro-1H-pyrimidine-5-carboxylic acid isopropyl ester::MLS000550516::SMR000115665::cid_4463724::isopropyl 6-(4-isopropoxy-3-methoxyphenyl)-4-methyl-2-sulfanyl-1,6-dihydropyrimidine-5-carboxylate::propan-2-yl 4-(3-methoxy-4-propan-2-yloxy-phenyl)-6-methyl-2-sulfanylidene-3,4-dihydro-1H-pyrimidine-5-carboxylate::propan-2-yl 4-(3-methoxy-4-propan-2-yloxyphenyl)-6-methyl-2-sulfanylidene-3,4-dihydro-1H-pyrimidine-5-carboxylate
SMILES COc1cc(ccc1OC(C)C)C1NC(=S)N=C(C)C1C(=O)OC(C)C
InChI Key InChIKey=MGDCUCOGFRYHED-UHFFFAOYSA-N
Data  2 EC50
  Tab Delimited (TSV)   2D SDfile   Computed 3D by Vconf -m prep SDfile
Find this compound or compounds like it in BindingDB:
Activity Spreadsheet -- Enzyme Inhibition Constant Data from BindingDB
Found 2 hits for monomerid = 52247
TargetZinc finger protein mex-5(Caenorhabditis elegans)
Broad Institute
Curated by PubChem BioAssay
LigandPNGBDBM52247(4-(3-methoxy-4-propan-2-yloxyphenyl)-6-methyl-2-su...)
Affinity DataEC50:  3.00E+5nM. Assay description: Broad Institute: MLPCN maternal gene expression Project ID: 2024 Keywords: Zinc finger, C. elegans, maternal gene expression, RNA-protein interac...
In DepthDetails PCBioAssay
TargetPOsterior Segregation(Caenorhabditis elegans)
Broad Institute
Curated by PubChem BioAssay
LigandPNGBDBM52247(4-(3-methoxy-4-propan-2-yloxyphenyl)-6-methyl-2-su...)
Affinity DataEC50:  3.00E+5nM. Assay description: Broad Institute: MLPCN maternal gene expression Project ID: 2024 Keywords: Zinc finger, C. elegans, maternal gene expression, RNA-protein interac...
In DepthDetails PCBioAssay