BDBM52255 (5E)-5-[[5-[(ethoxalylamino)methyl]-2-furyl]methylene]-4-keto-2-methyl-1-phenyl-2-pyrroline-3-carboxylic acid methyl ester::(5E)-5-[[5-[[(2-ethoxy-1,2-dioxoethyl)amino]methyl]-2-furanyl]methylidene]-2-methyl-4-oxo-1-phenyl-3-pyrrolecarboxylic acid methyl ester::MLS000519515::SMR000129934::cid_5291849::methyl (5E)-5-[[5-[[(2-ethoxy-2-oxidanylidene-ethanoyl)amino]methyl]furan-2-yl]methylidene]-2-methyl-4-oxidanylidene-1-phenyl-pyrrole-3-carboxylate::methyl (5E)-5-[[5-[[(2-ethoxy-2-oxoacetyl)amino]methyl]furan-2-yl]methylidene]-2-methyl-4-oxo-1-phenylpyrrole-3-carboxylate
SMILES CCOC(=O)C(=O)NCc1ccc(C=c2c(O)c(C(=O)OC)c(=C)n2-c2ccccc2)o1
InChI Key InChIKey=STTLXVSWOQMQBG-UHFFFAOYSA-N
Data  2 EC50
  Tab Delimited (TSV)   2D SDfile   Computed 3D by Vconf -m prep SDfile
Find this compound or compounds like it in BindingDB:
Activity Spreadsheet -- Enzyme Inhibition Constant Data from BindingDB
Found 2 hits for monomerid = 52255
TargetZinc finger protein mex-5(Caenorhabditis elegans)
Broad Institute
Curated by PubChem BioAssay
LigandPNGBDBM52255((5E)-5-[[5-[(ethoxalylamino)methyl]-2-furyl]methyl...)
Affinity DataEC50:  1.79E+5nM. Assay description: Broad Institute: MLPCN maternal gene expression Project ID: 2024 Keywords: Zinc finger, C. elegans, maternal gene expression, RNA-protein interac...
In DepthDetails PCBioAssay
TargetPOsterior Segregation(Caenorhabditis elegans)
Broad Institute
Curated by PubChem BioAssay
LigandPNGBDBM52255((5E)-5-[[5-[(ethoxalylamino)methyl]-2-furyl]methyl...)
Affinity DataEC50:  3.00E+5nM. Assay description: Broad Institute: MLPCN maternal gene expression Project ID: 2024 Keywords: Zinc finger, C. elegans, maternal gene expression, RNA-protein interac...
In DepthDetails PCBioAssay