BDBM52256 (4Z)-1-ethyl-2-methyl-5-oxo-4-(thiophen-2-ylmethylidene)-3-pyrrolecarboxylic acid methyl ester::(4Z)-1-ethyl-5-keto-2-methyl-4-(2-thenylidene)-2-pyrroline-3-carboxylic acid methyl ester::MLS000533672::SMR000141116::cid_1812437::methyl (4Z)-1-ethyl-2-methyl-5-oxidanylidene-4-(thiophen-2-ylmethylidene)pyrrole-3-carboxylate::methyl (4Z)-1-ethyl-2-methyl-5-oxo-4-(thiophen-2-ylmethylidene)pyrrole-3-carboxylate::methyl 1-ethyl-2-methyl-5-oxo-4-(2-thienylmethylene)-4,5-dihydro-1H-pyrrole-3-carboxylate
SMILES CCN1C(C)=C(C(=O)OC)\C(=C\c2cccs2)C1=O
InChI Key InChIKey=LALGOQYPXGQUGX-FLIBITNWSA-N
Data  2 EC50
  Tab Delimited (TSV)   2D SDfile   Computed 3D by Vconf -m prep SDfile
Find this compound or compounds like it in BindingDB:
Activity Spreadsheet -- Enzyme Inhibition Constant Data from BindingDB
Found 2 hits for monomerid = 52256
TargetZinc finger protein mex-5(Caenorhabditis elegans)
Broad Institute
Curated by PubChem BioAssay
LigandPNGBDBM52256((4Z)-1-ethyl-2-methyl-5-oxo-4-(thiophen-2-ylmethyl...)
Affinity DataEC50:  3.00E+5nM. Assay description: Broad Institute: MLPCN maternal gene expression Project ID: 2024 Keywords: Zinc finger, C. elegans, maternal gene expression, RNA-protein interac...
In DepthDetails PCBioAssay
TargetPOsterior Segregation(Caenorhabditis elegans)
Broad Institute
Curated by PubChem BioAssay
LigandPNGBDBM52256((4Z)-1-ethyl-2-methyl-5-oxo-4-(thiophen-2-ylmethyl...)
Affinity DataEC50:  3.00E+5nM. Assay description: Broad Institute: MLPCN maternal gene expression Project ID: 2024 Keywords: Zinc finger, C. elegans, maternal gene expression, RNA-protein interac...
In DepthDetails PCBioAssay