BDBM52265 1-[5-(2,4-dichlorophenyl)-2-furanyl]-6,7-dimethoxy-3,4-dihydroisoquinoline::1-[5-(2,4-dichlorophenyl)-2-furyl]-6,7-dimethoxy-3,4-dihydroisoquinoline::1-[5-(2,4-dichlorophenyl)furan-2-yl]-6,7-dimethoxy-3,4-dihydroisoquinoline::MLS000537648::SMR000143890::cid_1527238
SMILES COc1cc2CCN=C(c3ccc(o3)-c3ccc(Cl)cc3Cl)c2cc1OC
InChI Key InChIKey=OKXSCKAQLXJNPE-UHFFFAOYSA-N
Data  3 EC50
  Tab Delimited (TSV)   2D SDfile   Computed 3D by Vconf -m prep SDfile
Find this compound or compounds like it in BindingDB:
Activity Spreadsheet -- Enzyme Inhibition Constant Data from BindingDB
Found 3 hits for monomerid = 52265
TargetPOsterior Segregation(Caenorhabditis elegans)
Broad Institute
Curated by PubChem BioAssay
LigandPNGBDBM52265(1-[5-(2,4-dichlorophenyl)-2-furanyl]-6,7-dimethoxy...)
Affinity DataEC50:  3.00E+5nM. Assay description: Broad Institute: MLPCN maternal gene expression Project ID: 2024 Keywords: Zinc finger, C. elegans, maternal gene expression, RNA-protein interac...
In DepthDetails PCBioAssay
TargetG-protein coupled receptor 55(Homo sapiens (Human))
Burnham Center For Chemical Genomics
Curated by PubChem BioAssay
LigandPNGBDBM52265(1-[5-(2,4-dichlorophenyl)-2-furanyl]-6,7-dimethoxy...)
Affinity DataEC50:  3.20E+4nM. Assay description: Data Source: Sanford-Burnham Center for Chemical Genomics (SBCCG) Source Affiliation: Sanford-Burnham Medical Research Institute (SBMRI, San Diego, C...
In DepthDetails PCBioAssay
TargetZinc finger protein mex-5(Caenorhabditis elegans)
Broad Institute
Curated by PubChem BioAssay
LigandPNGBDBM52265(1-[5-(2,4-dichlorophenyl)-2-furanyl]-6,7-dimethoxy...)
Affinity DataEC50:  3.00E+5nM. Assay description: Broad Institute: MLPCN maternal gene expression Project ID: 2024 Keywords: Zinc finger, C. elegans, maternal gene expression, RNA-protein interac...
In DepthDetails PCBioAssay