BDBM52320 (6E)-4-chloranyl-6-[[[2-[(3,5-dimethyl-1H-pyrazol-4-yl)sulfanyl]phenyl]amino]methylidene]-2-nitro-cyclohexa-2,4-dien-1-one::(6E)-4-chloro-6-[[2-[(3,5-dimethyl-1H-pyrazol-4-yl)sulfanyl]anilino]methylidene]-2-nitrocyclohexa-2,4-dien-1-one::(6E)-4-chloro-6-[[2-[(3,5-dimethyl-1H-pyrazol-4-yl)thio]anilino]methylene]-2-nitro-cyclohexa-2,4-dien-1-one::(6E)-4-chloro-6-[[2-[(3,5-dimethyl-1H-pyrazol-4-yl)thio]anilino]methylidene]-2-nitro-1-cyclohexa-2,4-dienone::4-chloro-2-[({2-[(3,5-dimethyl-1H-pyrazol-4-yl)thio]phenyl}imino)methyl]-6-nitrophenol::MLS000530337::SMR000135313::cid_5455181
SMILES Cc1n[nH]c(C)c1Sc1ccccc1\[NH+]=C\[c-]1cc(Cl)cc([N+]([O-])=O)c1=O
InChI Key InChIKey=MNPTWIPBOINQCO-AWQFTUOYSA-O
Data  2 EC50
  Tab Delimited (TSV)   2D SDfile   Computed 3D by Vconf -m prep SDfile
Find this compound or compounds like it in BindingDB:
Activity Spreadsheet -- Enzyme Inhibition Constant Data from BindingDB
Found 2 hits for monomerid = 52320
TargetZinc finger protein mex-5(Caenorhabditis elegans)
Broad Institute
Curated by PubChem BioAssay
LigandPNGBDBM52320((6E)-4-chloranyl-6-[[[2-[(3,5-dimethyl-1H-pyrazol-...)
Affinity DataEC50:  7.57E+3nM. Assay description: Broad Institute: MLPCN maternal gene expression Project ID: 2024 Keywords: Zinc finger, C. elegans, maternal gene expression, RNA-protein interac...
In DepthDetails PCBioAssay
TargetPOsterior Segregation(Caenorhabditis elegans)
Broad Institute
Curated by PubChem BioAssay
LigandPNGBDBM52320((6E)-4-chloranyl-6-[[[2-[(3,5-dimethyl-1H-pyrazol-...)
Affinity DataEC50:  3.00E+5nM. Assay description: Broad Institute: MLPCN maternal gene expression Project ID: 2024 Keywords: Zinc finger, C. elegans, maternal gene expression, RNA-protein interac...
In DepthDetails PCBioAssay