BDBM52342 1-[(1,5-dimethylpyrazol-3-yl)carbonylamino]-3-(2-methoxyphenyl)thiourea::1-[(1,5-dimethylpyrazole-3-carbonyl)amino]-3-(2-methoxyphenyl)thiourea::1-[[(1,5-dimethyl-3-pyrazolyl)-oxomethyl]amino]-3-(2-methoxyphenyl)thiourea::2-[(1,5-dimethyl-1H-pyrazol-3-yl)carbonyl]-N-(2-methoxyphenyl)hydrazinecarbothioamide::MLS000544429::SMR000159951::cid_842644
SMILES COc1ccccc1NC(=S)NNC(=O)c1cc(C)n(C)n1
InChI Key InChIKey=AKYGOEVGMSSOLO-UHFFFAOYSA-N
Data  2 EC50
  Tab Delimited (TSV)   2D SDfile   Computed 3D by Vconf -m prep SDfile
Find this compound or compounds like it in BindingDB:
Activity Spreadsheet -- Enzyme Inhibition Constant Data from BindingDB
Found 2 hits for monomerid = 52342
TargetZinc finger protein mex-5(Caenorhabditis elegans)
Broad Institute
Curated by PubChem BioAssay
LigandPNGBDBM52342(1-[(1,5-dimethylpyrazol-3-yl)carbonylamino]-3-(2-m...)
Affinity DataEC50:  5.84E+4nM. Assay description: Broad Institute: MLPCN maternal gene expression Project ID: 2024 Keywords: Zinc finger, C. elegans, maternal gene expression, RNA-protein interac...
In DepthDetails PCBioAssay
TargetPOsterior Segregation(Caenorhabditis elegans)
Broad Institute
Curated by PubChem BioAssay
LigandPNGBDBM52342(1-[(1,5-dimethylpyrazol-3-yl)carbonylamino]-3-(2-m...)
Affinity DataEC50:  5.03E+4nM. Assay description: Broad Institute: MLPCN maternal gene expression Project ID: 2024 Keywords: Zinc finger, C. elegans, maternal gene expression, RNA-protein interac...
In DepthDetails PCBioAssay