BDBM52374 (2E)-2-(4-butoxybenzylidene)benzothiophen-3-one::(2E)-2-[(4-butoxyphenyl)methylidene]-1-benzothiophen-3-one::2-(4-Butoxy-benzylidene)-benzo[b]thiophen-3-one::MLS000563349::SMR000175242::cid_1732631
SMILES CCCCOc1ccc(\C=C2\Sc3ccccc3C2=O)cc1
InChI Key InChIKey=RUYBZYJLMHUCCU-QGOAFFKASA-N
Data  1 IC50  2 EC50
  Tab Delimited (TSV)   2D SDfile   Computed 3D by Vconf -m prep SDfile
Find this compound or compounds like it in BindingDB:
Activity Spreadsheet -- Enzyme Inhibition Constant Data from BindingDB
Found 3 hits for monomerid = 52374
TargetPOsterior Segregation(Caenorhabditis elegans)
Broad Institute
Curated by PubChem BioAssay
LigandPNGBDBM52374((2E)-2-(4-butoxybenzylidene)benzothiophen-3-one | ...)
Affinity DataEC50:  1.58E+5nM. Assay description: Broad Institute: MLPCN maternal gene expression Project ID: 2024 Keywords: Zinc finger, C. elegans, maternal gene expression, RNA-protein interac...
In DepthDetails PCBioAssay
TargetProtein artemis(Homo sapiens (Human))
Burnham Center For Chemical Genomics
Curated by PubChem BioAssay
LigandPNGBDBM52374((2E)-2-(4-butoxybenzylidene)benzothiophen-3-one | ...)
Affinity DataIC50:  2.00E+4nM. Assay description: Data Source: Sanford-Burnham Center for Chemical Genomics (SBCCG) Source Affiliation: Sanford-Burnham Medical Research Institute (SBMRI, San Diego CA...
In DepthDetails PCBioAssay
TargetZinc finger protein mex-5(Caenorhabditis elegans)
Broad Institute
Curated by PubChem BioAssay
LigandPNGBDBM52374((2E)-2-(4-butoxybenzylidene)benzothiophen-3-one | ...)
Affinity DataEC50:  1.77E+5nM. Assay description: Broad Institute: MLPCN maternal gene expression Project ID: 2024 Keywords: Zinc finger, C. elegans, maternal gene expression, RNA-protein interac...
In DepthDetails PCBioAssay