BDBM52437 3-Ethyl-2-[2-(2-methyl-1H-indol-3-yl)-vinyl]-3H-quinazolin-4-one::3-ethyl-2-[(E)-2-(2-methyl-1H-indol-3-yl)ethenyl]-4-quinazolinone::3-ethyl-2-[(E)-2-(2-methyl-1H-indol-3-yl)ethenyl]quinazolin-4-one::3-ethyl-2-[(E)-2-(2-methyl-1H-indol-3-yl)vinyl]quinazolin-4-one::MLS000566893::SMR000176456::cid_5761675
SMILES CCn1c(\C=C\c2c(C)[nH]c3ccccc23)nc2ccccc2c1=O
InChI Key InChIKey=IOWRYAAXGNIWOH-OUKQBFOZSA-N
Data  4 EC50
  Tab Delimited (TSV)   2D SDfile   Computed 3D by Vconf -m prep SDfile
Find this compound or compounds like it in BindingDB:
Activity Spreadsheet -- Enzyme Inhibition Constant Data from BindingDB
Found 4 hits for monomerid = 52437
TargetPOsterior Segregation(Caenorhabditis elegans)
Broad Institute
Curated by PubChem BioAssay
LigandPNGBDBM52437(3-Ethyl-2-[2-(2-methyl-1H-indol-3-yl)-vinyl]-3H-qu...)
Affinity DataEC50:  3.00E+5nM. Assay description: Broad Institute: MLPCN maternal gene expression Project ID: 2024 Keywords: Zinc finger, C. elegans, maternal gene expression, RNA-protein interac...
In DepthDetails PCBioAssay
TargetEndoribonuclease toxin MazF(Escherichia coli str. K-12 substr. MG1655)
Burnham Center For Chemical Genomics
Curated by PubChem BioAssay
LigandPNGBDBM52437(3-Ethyl-2-[2-(2-methyl-1H-indol-3-yl)-vinyl]-3H-qu...)
Affinity DataEC50: >9.90E+4nM. Assay description: Data Source: Sanford-Burnham Center for Chemical Genomics (SBCCG) Source Affiliation: Sanford-Burnham Medical Research Institute (SBMRI, San Diego, C...
In DepthDetails PCBioAssay
TargetEndoribonuclease toxin MazF(Escherichia coli str. K-12 substr. MG1655)
Burnham Center For Chemical Genomics
Curated by PubChem BioAssay
LigandPNGBDBM52437(3-Ethyl-2-[2-(2-methyl-1H-indol-3-yl)-vinyl]-3H-qu...)
Affinity DataEC50: >9.90E+4nM. Assay description: Data Source: Sanford-Burnham Center for Chemical Genomics (SBCCG) Source Affiliation: Sanford-Burnham Medical Research Institute (SBMRI, San Diego, C...
In DepthDetails PCBioAssay
TargetZinc finger protein mex-5(Caenorhabditis elegans)
Broad Institute
Curated by PubChem BioAssay
LigandPNGBDBM52437(3-Ethyl-2-[2-(2-methyl-1H-indol-3-yl)-vinyl]-3H-qu...)
Affinity DataEC50:  3.00E+5nM. Assay description: Broad Institute: MLPCN maternal gene expression Project ID: 2024 Keywords: Zinc finger, C. elegans, maternal gene expression, RNA-protein interac...
In DepthDetails PCBioAssay