BDBM52531 2,8-bis(sulfanylidene)-7,9-dihydro-3H-purin-6-one::2,8-dithioxo-7,9-dihydro-3H-purin-6-one::MLS000394813::SMR000242902::cid_2366465
SMILES O=c1[nH]c(=S)[nH]c2[nH]c(=S)[nH]c12
InChI Key InChIKey=NDSUZZIWNBVBKW-UHFFFAOYSA-N
Data  2 EC50
PDB links: 3 PDB IDs match this monomer.
  Tab Delimited (TSV)   2D SDfile   Computed 3D by Vconf -m prep SDfile
Find this compound or compounds like it in BindingDB:
Activity Spreadsheet -- Enzyme Inhibition Constant Data from BindingDB
Found 2 hits for monomerid = 52531
TargetZinc finger protein mex-5(Caenorhabditis elegans)
Broad Institute
Curated by PubChem BioAssay
LigandPNGBDBM52531(2,8-bis(sulfanylidene)-7,9-dihydro-3H-purin-6-one ...)
Affinity DataEC50:  8.30E+3nM. Assay description: Broad Institute: MLPCN maternal gene expression Project ID: 2024 Keywords: Zinc finger, C. elegans, maternal gene expression, RNA-protein interac...
In DepthDetails PCBioAssay
TargetPOsterior Segregation(Caenorhabditis elegans)
Broad Institute
Curated by PubChem BioAssay
LigandPNGBDBM52531(2,8-bis(sulfanylidene)-7,9-dihydro-3H-purin-6-one ...)
Affinity DataEC50:  3.20E+4nM. Assay description: Broad Institute: MLPCN maternal gene expression Project ID: 2024 Keywords: Zinc finger, C. elegans, maternal gene expression, RNA-protein interac...
In DepthDetails PCBioAssay