BDBM52621 (4Z)-4-(4-hydroxy-3-methoxy-5-nitro-benzylidene)-1-(m-tolyl)pyrazolidine-3,5-quinone::(4Z)-4-[(3-methoxy-5-nitro-4-oxidanyl-phenyl)methylidene]-1-(3-methylphenyl)pyrazolidine-3,5-dione::(4Z)-4-[(4-hydroxy-3-methoxy-5-nitrophenyl)methylidene]-1-(3-methylphenyl)pyrazolidine-3,5-dione::4-(4-hydroxy-3-methoxy-5-nitrobenzylidene)-1-(3-methylphenyl)-3,5-pyrazolidinedione::MLS000626744::SMR000299131::cid_2176498
SMILES COc1cc(\C=C2\C(=O)NN(C2=O)c2cccc(C)c2)cc(c1O)[N+]([O-])=O
InChI Key InChIKey=OVGKGOCKQDNRIG-QPEQYQDCSA-N
Data  4 IC50  2 EC50
  Tab Delimited (TSV)   2D SDfile   Computed 3D by Vconf -m prep SDfile
Find this compound or compounds like it in BindingDB:
Activity Spreadsheet -- Enzyme Inhibition Constant Data from BindingDB
Found 6 hits for monomerid = 52621
TargetPOsterior Segregation(Caenorhabditis elegans)
Broad Institute
Curated by PubChem BioAssay
LigandPNGBDBM52621((4Z)-4-(4-hydroxy-3-methoxy-5-nitro-benzylidene)-1...)
Affinity DataEC50:  3.00E+5nM. Assay description: Broad Institute: MLPCN maternal gene expression Project ID: 2024 Keywords: Zinc finger, C. elegans, maternal gene expression, RNA-protein interac...
In DepthDetails PCBioAssay
TargetZinc finger protein mex-5(Caenorhabditis elegans)
Broad Institute
Curated by PubChem BioAssay
LigandPNGBDBM52621((4Z)-4-(4-hydroxy-3-methoxy-5-nitro-benzylidene)-1...)
Affinity DataEC50:  8.91E+4nM. Assay description: Broad Institute: MLPCN maternal gene expression Project ID: 2024 Keywords: Zinc finger, C. elegans, maternal gene expression, RNA-protein interac...
In DepthDetails PCBioAssay
TargetTyrosine-protein phosphatase non-receptor type 5(Homo sapiens (Human))
Burnham Center For Chemical Genomics
Curated by PubChem BioAssay
LigandPNGBDBM52621((4Z)-4-(4-hydroxy-3-methoxy-5-nitro-benzylidene)-1...)
Affinity DataIC50: >8.00E+4nM. Assay description: Data Source: Sanford-Burnham Center for Chemical Genomics (SBCCG) Source Affiliation: Sanford-Burnham Medical Research Institute (SBMRI, San Diego, C...
In DepthDetails PCBioAssay
TargetDual specificity protein phosphatase 3(Homo sapiens (Human))
Burnham Center For Chemical Genomics
Curated by PubChem BioAssay
LigandPNGBDBM52621((4Z)-4-(4-hydroxy-3-methoxy-5-nitro-benzylidene)-1...)
Affinity DataIC50:  4.11E+3nM. Assay description: Data Source: Sanford-Burnham Center for Chemical Genomics (SBCCG) Source Affiliation: Sanford-Burnham Medical Research Institute (SBMRI, San Diego, C...
In DepthDetails PCBioAssay
TargetTyrosine-protein phosphatase non-receptor type 11(Homo sapiens (Human))
Burnham Center For Chemical Genomics
Curated by PubChem BioAssay
LigandPNGBDBM52621((4Z)-4-(4-hydroxy-3-methoxy-5-nitro-benzylidene)-1...)
Affinity DataIC50:  5.63E+3nM. Assay description: Data Source: Sanford-Burnham Center for Chemical Genomics (SBCCG) Source Affiliation: Sanford-Burnham Medical Research Institute (SBMRI, San Diego, C...
In DepthDetails PCBioAssay
TargetTyrosine-protein phosphatase non-receptor type 5(Homo sapiens (Human))
Burnham Center For Chemical Genomics
Curated by PubChem BioAssay
LigandPNGBDBM52621((4Z)-4-(4-hydroxy-3-methoxy-5-nitro-benzylidene)-1...)
Affinity DataIC50:  2.55E+4nM. Assay description: Data Source: Sanford-Burnham Center for Chemical Genomics (SBCCG) Source Affiliation: Sanford-Burnham Medical Research Institute (SBMRI, San Diego, C...
In DepthDetails PCBioAssay