BDBM52751 3-[(4-chloranyl-3-nitro-phenyl)methylideneamino]-2-sulfanylidene-1,3-thiazolidin-4-one::3-[(4-chloro-3-nitro-benzylidene)amino]-2-thioxo-thiazolidin-4-one::3-[(4-chloro-3-nitrophenyl)methylideneamino]-2-sulfanylidene-1,3-thiazolidin-4-one::3-[(4-chloro-3-nitrophenyl)methylideneamino]-2-sulfanylidene-4-thiazolidinone::MLS001006776::SMR000349747::cid_276641
SMILES Oc1csc(=S)n1[N-][CH+]c1ccc(Cl)c(c1)[N+]([O-])=O
InChI Key InChIKey=GOCIFAFNBYWYKT-UHFFFAOYSA-N
Data  1 IC50  2 EC50
  Tab Delimited (TSV)   2D SDfile   Computed 3D by Vconf -m prep SDfile
Find this compound or compounds like it in BindingDB:
Activity Spreadsheet -- Enzyme Inhibition Constant Data from BindingDB
Found 3 hits for monomerid = 52751
TargetPOsterior Segregation(Caenorhabditis elegans)
Broad Institute
Curated by PubChem BioAssay
LigandPNGBDBM52751(3-[(4-chloranyl-3-nitro-phenyl)methylideneamino]-2...)
Affinity DataEC50:  1.86E+4nM. Assay description: Broad Institute: MLPCN maternal gene expression Project ID: 2024 Keywords: Zinc finger, C. elegans, maternal gene expression, RNA-protein interac...
In DepthDetails PCBioAssay
TargetCore protein(Hepatitis C virus)
The Scripps Research Institute Molecular Screening Center
Curated by PubChem BioAssay
LigandPNGBDBM52751(3-[(4-chloranyl-3-nitro-phenyl)methylideneamino]-2...)
Affinity DataIC50: >4.98E+4nM. Assay description: Source (MLPCN Center Name): The Scripps Research Institute Molecular Screening Center Affiliation: The Scripps Research Institute, TSRI Assay Provide...
In DepthDetails PCBioAssay
TargetZinc finger protein mex-5(Caenorhabditis elegans)
Broad Institute
Curated by PubChem BioAssay
LigandPNGBDBM52751(3-[(4-chloranyl-3-nitro-phenyl)methylideneamino]-2...)
Affinity DataEC50:  1.57E+4nM. Assay description: Broad Institute: MLPCN maternal gene expression Project ID: 2024 Keywords: Zinc finger, C. elegans, maternal gene expression, RNA-protein interac...
In DepthDetails PCBioAssay