BDBM52936 1-(3,5-dimethylphenyl)-3-(6-methoxy-3-pyridinyl)urea::1-(3,5-dimethylphenyl)-3-(6-methoxy-3-pyridyl)urea::1-(3,5-dimethylphenyl)-3-(6-methoxypyridin-3-yl)urea::MLS000858789::N-(3,5-dimethylphenyl)-N'-(6-methoxy-3-pyridinyl)urea::SMR000458868::cid_2815594
SMILES COc1ccc(NC(=O)Nc2cc(C)cc(C)c2)cn1
InChI Key InChIKey=BNQVUQSZXQSEBE-UHFFFAOYSA-N
Data  2 IC50  2 EC50
  Tab Delimited (TSV)   2D SDfile   Computed 3D by Vconf -m prep SDfile
Find this compound or compounds like it in BindingDB:
Activity Spreadsheet -- Enzyme Inhibition Constant Data from BindingDB
Found 4 hits for monomerid = 52936
TargetPOsterior Segregation(Caenorhabditis elegans)
Broad Institute
Curated by PubChem BioAssay
LigandPNGBDBM52936(1-(3,5-dimethylphenyl)-3-(6-methoxy-3-pyridinyl)ur...)
Affinity DataEC50:  1.86E+5nM. Assay description: Broad Institute: MLPCN maternal gene expression Project ID: 2024 Keywords: Zinc finger, C. elegans, maternal gene expression, RNA-protein interac...
In DepthDetails PCBioAssay
TargetFemale germline-specific tumor suppressor gld-1(Caenorhabditis elegans)
The Scripps Research Institute Molecular Screening Center
Curated by PubChem BioAssay
LigandPNGBDBM52936(1-(3,5-dimethylphenyl)-3-(6-methoxy-3-pyridinyl)ur...)
Affinity DataIC50:  7.15E+3nM. Assay description: Source (MLPCN Center Name): The Scripps Research Institute Molecular Screening Center (SRIMSC) Affiliation: The Scripps Research Institute, TSRI Assa...
In DepthDetails PCBioAssay
TargetProtein Rev(Human immunodeficiency virus 1)
The Scripps Research Institute Molecular Screening Center
Curated by PubChem BioAssay
LigandPNGBDBM52936(1-(3,5-dimethylphenyl)-3-(6-methoxy-3-pyridinyl)ur...)
Affinity DataIC50:  1.14E+4nM. Assay description: Source (MLPCN Center Name): The Scripps Research Institute Molecular Screening Center (SRIMSC) Affiliation: The Scripps Research Institute, TSRI Assa...
In DepthDetails PCBioAssay
TargetZinc finger protein mex-5(Caenorhabditis elegans)
Broad Institute
Curated by PubChem BioAssay
LigandPNGBDBM52936(1-(3,5-dimethylphenyl)-3-(6-methoxy-3-pyridinyl)ur...)
Affinity DataEC50:  2.74E+4nM. Assay description: Broad Institute: MLPCN maternal gene expression Project ID: 2024 Keywords: Zinc finger, C. elegans, maternal gene expression, RNA-protein interac...
In DepthDetails PCBioAssay