BDBM53204 2-[2-ethoxy-4-[(Z)-[2-(4-ethylanilino)-4-keto-2-thiazolin-5-ylidene]methyl]phenoxy]acetic acid::2-[2-ethoxy-4-[(Z)-[2-(4-ethylanilino)-4-oxo-1,3-thiazol-5-ylidene]methyl]phenoxy]acetic acid::2-[2-ethoxy-4-[(Z)-[2-(4-ethylanilino)-4-oxo-5-thiazolylidene]methyl]phenoxy]acetic acid::2-[2-ethoxy-4-[(Z)-[2-[(4-ethylphenyl)amino]-4-oxidanylidene-1,3-thiazol-5-ylidene]methyl]phenoxy]ethanoic acid::MLS001212635::SMR000517249::cid_5765585::{2-Ethoxy-4-[2-(4-ethyl-phenylimino)-4-oxo-thiazolidin-5-ylidenemethyl]-phenoxy}-acetic acid
SMILES CCOc1cc(C=C2SC(Nc3ccc(CC)cc3)=NC2=O)ccc1OCC(O)=O
InChI Key InChIKey=WVVAVLXFJYMBNQ-UHFFFAOYSA-N
Data  2 EC50
  Tab Delimited (TSV)   2D SDfile   Computed 3D by Vconf -m prep SDfile
Find this compound or compounds like it in BindingDB:
Activity Spreadsheet -- Enzyme Inhibition Constant Data from BindingDB
Found 2 hits for monomerid = 53204
TargetZinc finger protein mex-5(Caenorhabditis elegans)
Broad Institute
Curated by PubChem BioAssay
LigandPNGBDBM53204(2-[2-ethoxy-4-[(Z)-[2-(4-ethylanilino)-4-keto-2-th...)
Affinity DataEC50:  1.49E+5nM. Assay description: Broad Institute: MLPCN maternal gene expression Project ID: 2024 Keywords: Zinc finger, C. elegans, maternal gene expression, RNA-protein interac...
In DepthDetails PCBioAssay
TargetPOsterior Segregation(Caenorhabditis elegans)
Broad Institute
Curated by PubChem BioAssay
LigandPNGBDBM53204(2-[2-ethoxy-4-[(Z)-[2-(4-ethylanilino)-4-keto-2-th...)
Affinity DataEC50:  2.56E+4nM. Assay description: Broad Institute: MLPCN maternal gene expression Project ID: 2024 Keywords: Zinc finger, C. elegans, maternal gene expression, RNA-protein interac...
In DepthDetails PCBioAssay