BDBM53486 4-(phenylmethyl)-5-thieno[3,2-b]pyrrolecarboxylic acid ethyl ester::4-Benzyl-4H-thieno[3,2-b]pyrrole-5-carboxylic acid ethyl ester::4-benzylthieno[3,2-b]pyrrole-5-carboxylic acid ethyl ester::MLS000068097::SMR000007154::cid_649131::ethyl 4-(phenylmethyl)thieno[3,2-b]pyrrole-5-carboxylate::ethyl 4-benzylthieno[3,2-b]pyrrole-5-carboxylate
SMILES CCOC(=O)c1cc2sccc2n1Cc1ccccc1
InChI Key InChIKey=GGZMKBBXTLBXLL-UHFFFAOYSA-N
Data  1 IC50
  Tab Delimited (TSV)   2D SDfile   Computed 3D by Vconf -m prep SDfile
Find this compound or compounds like it in BindingDB:
Activity Spreadsheet -- Enzyme Inhibition Constant Data from BindingDB
Found 1 hit for monomerid = 53486
TargetDual specificity protein phosphatase 6(Rattus norvegicus)
Sanford-Burnham Center For Chemical Genomics
Curated by PubChem BioAssay
LigandPNGBDBM53486(4-(phenylmethyl)-5-thieno[3,2-b]pyrrolecarboxylic ...)
Affinity DataIC50:  1.00E+5nM. Assay description: Data Source: Sanford-Burnham Center for Chemical Genomics (SBCCG) Source Affiliation: Sanford-Burnham Medical Research Institute (SBMRI, San Diego, C...
In DepthDetails PCBioAssay