BDBM53493 2-[(4,6-dimethyl-2-pyridyl)carbamoylamino]benzoic acid methyl ester::2-[[[(4,6-dimethyl-2-pyridinyl)amino]-oxomethyl]amino]benzoic acid methyl ester::MLS000064020::SMR000077021::cid_971446::methyl 2-({[(4,6-dimethyl-2-pyridinyl)amino]carbonyl}amino)benzoate::methyl 2-[(4,6-dimethylpyridin-2-yl)carbamoylamino]benzoate
SMILES COC(=O)c1ccccc1NC(=O)Nc1cc(C)cc(C)n1
InChI Key InChIKey=ILIGLHWCBXUSJB-UHFFFAOYSA-N
Data  1 IC50
  Tab Delimited (TSV)   2D SDfile   Computed 3D by Vconf -m prep SDfile
Find this compound or compounds like it in BindingDB:
Activity Spreadsheet -- Enzyme Inhibition Constant Data from BindingDB
Found 1 hit for monomerid = 53493
TargetDual specificity protein phosphatase 6(Rattus norvegicus)
Sanford-Burnham Center For Chemical Genomics
Curated by PubChem BioAssay
LigandPNGBDBM53493(2-[(4,6-dimethyl-2-pyridyl)carbamoylamino]benzoic ...)
Affinity DataIC50:  1.00E+5nM. Assay description: Data Source: Sanford-Burnham Center for Chemical Genomics (SBCCG) Source Affiliation: Sanford-Burnham Medical Research Institute (SBMRI, San Diego, C...
In DepthDetails PCBioAssay