BDBM53510 MLS000073728::N-(5-Ethyl-[1,3,4]thiadiazol-2-yl)-2-[4-isobutyl-5-(2-methyl-furan-3-yl)-4H-[1,2,4]triazol-3-ylsulfanyl]-acetamide::N-(5-ethyl-1,3,4-thiadiazol-2-yl)-2-[[4-isobutyl-5-(2-methyl-3-furyl)-1,2,4-triazol-3-yl]thio]acetamide::N-(5-ethyl-1,3,4-thiadiazol-2-yl)-2-[[5-(2-methyl-3-furanyl)-4-(2-methylpropyl)-1,2,4-triazol-3-yl]thio]acetamide::N-(5-ethyl-1,3,4-thiadiazol-2-yl)-2-[[5-(2-methylfuran-3-yl)-4-(2-methylpropyl)-1,2,4-triazol-3-yl]sulfanyl]acetamide::N-(5-ethyl-1,3,4-thiadiazol-2-yl)-2-[[5-(2-methylfuran-3-yl)-4-(2-methylpropyl)-1,2,4-triazol-3-yl]sulfanyl]ethanamide::SMR000005711::cid_655910
SMILES CCc1nnc(NC(=O)CSc2nnc(-c3ccoc3C)n2CC(C)C)s1
InChI Key InChIKey=HSMBFKVOTOXWBD-UHFFFAOYSA-N
Data  1 IC50
  Tab Delimited (TSV)   2D SDfile   Computed 3D by Vconf -m prep SDfile
Find this compound or compounds like it in BindingDB:
Activity Spreadsheet -- Enzyme Inhibition Constant Data from BindingDB
Found 1 hit for monomerid = 53510
TargetTyrosine-protein phosphatase non-receptor type 7(Homo sapiens (Human))
Burnham Center For Chemical Genomics
Curated by PubChem BioAssay
LigandPNGBDBM53510(MLS000073728 | N-(5-Ethyl-[1,3,4]thiadiazol-2-yl)-...)
Affinity DataIC50:  1.00E+5nM. Assay description: Data Source: Sanford-Burnham Center for Chemical Genomics (SBCCG) Source Affiliation: Sanford-Burnham Medical Research Institute (SBMRI, San Diego, C...
In DepthDetails PCBioAssay