BDBM53514 3-methyl-1,1-diphenyl-urea::3-methyl-1,1-diphenylurea::MLS000038862::SMR000037238::cid_25711
SMILES CNC(=O)N(c1ccccc1)c1ccccc1
InChI Key InChIKey=IMFYAZJNDOZIFV-UHFFFAOYSA-N
Data  1 IC50
  Tab Delimited (TSV)   2D SDfile   Computed 3D by Vconf -m prep SDfile
Find this compound or compounds like it in BindingDB:
Activity Spreadsheet -- Enzyme Inhibition Constant Data from BindingDB
Found 1 hit for monomerid = 53514
TargetTyrosine-protein phosphatase non-receptor type 7(Homo sapiens (Human))
Burnham Center For Chemical Genomics
Curated by PubChem BioAssay
LigandPNGBDBM53514(3-methyl-1,1-diphenyl-urea | 3-methyl-1,1-diphenyl...)
Affinity DataIC50:  1.00E+5nM. Assay description: Data Source: Sanford-Burnham Center for Chemical Genomics (SBCCG) Source Affiliation: Sanford-Burnham Medical Research Institute (SBMRI, San Diego, C...
In DepthDetails PCBioAssay