BDBM53558 7,8-dimethoxy-N-methyl-4,5-dihydro-3H-2-benzazepine-1-carboxamide::MLS000058886::SMR000069455::cid_755117
SMILES CNC(=O)C1=NCCCc2cc(OC)c(OC)cc12
InChI Key InChIKey=VWOFBJCYOXUHRT-UHFFFAOYSA-N
Data  1 IC50
  Tab Delimited (TSV)   2D SDfile   Computed 3D by Vconf -m prep SDfile
Find this compound or compounds like it in BindingDB:
Activity Spreadsheet -- Enzyme Inhibition Constant Data from BindingDB
Found 1 hit for monomerid = 53558
TargetTyrosine-protein phosphatase non-receptor type 7(Homo sapiens (Human))
Burnham Center For Chemical Genomics
Curated by PubChem BioAssay
LigandPNGBDBM53558(7,8-dimethoxy-N-methyl-4,5-dihydro-3H-2-benzazepin...)
Affinity DataIC50:  1.00E+5nM. Assay description: Data Source: Sanford-Burnham Center for Chemical Genomics (SBCCG) Source Affiliation: Sanford-Burnham Medical Research Institute (SBMRI, San Diego, C...
In DepthDetails PCBioAssay