BDBM53577 MLS000102531::N-(2-furanylmethyl)-2-[3-(4-methylphenyl)-7-oxo-6-triazolo[4,5-d]pyrimidinyl]acetamide::N-(2-furfuryl)-2-[7-keto-3-(p-tolyl)triazolo[4,5-d]pyrimidin-6-yl]acetamide::N-(furan-2-ylmethyl)-2-[3-(4-methylphenyl)-7-oxidanylidene-[1,2,3]triazolo[4,5-d]pyrimidin-6-yl]ethanamide::N-(furan-2-ylmethyl)-2-[3-(4-methylphenyl)-7-oxotriazolo[4,5-d]pyrimidin-6-yl]acetamide::SMR000016707::cid_5310027
SMILES Cc1ccc(cc1)-n1nnc2c1ncn(CC(=O)NCc1ccco1)c2=O
InChI Key InChIKey=PQAJZYSCBOQHMS-UHFFFAOYSA-N
Data  1 IC50
  Tab Delimited (TSV)   2D SDfile   Computed 3D by Vconf -m prep SDfile
Find this compound or compounds like it in BindingDB:
Activity Spreadsheet -- Enzyme Inhibition Constant Data from BindingDB
Found 1 hit for monomerid = 53577
TargetTyrosine-protein phosphatase non-receptor type 7(Homo sapiens (Human))
Burnham Center For Chemical Genomics
Curated by PubChem BioAssay
LigandPNGBDBM53577(MLS000102531 | N-(2-furanylmethyl)-2-[3-(4-methylp...)
Affinity DataIC50:  1.00E+5nM. Assay description: Data Source: Sanford-Burnham Center for Chemical Genomics (SBCCG) Source Affiliation: Sanford-Burnham Medical Research Institute (SBMRI, San Diego, C...
In DepthDetails PCBioAssay