BDBM53582 (1,3-dioxoisoindol-2-yl)methyl thiophene-2-carboxylate::2-thiophenecarboxylic acid (1,3-dioxo-2-isoindolyl)methyl ester::MLS000113772::SMR000109664::[1,3-bis(oxidanylidene)isoindol-2-yl]methyl thiophene-2-carboxylate::cid_895701::thiophene-2-carboxylic acid phthalimidomethyl ester
SMILES O=C(OCN1C(=O)c2ccccc2C1=O)c1cccs1
InChI Key InChIKey=VVTHLSCUZVFCKT-UHFFFAOYSA-N
Data  1 IC50
  Tab Delimited (TSV)   2D SDfile   Computed 3D by Vconf -m prep SDfile
Find this compound or compounds like it in BindingDB:
Activity Spreadsheet -- Enzyme Inhibition Constant Data from BindingDB
Found 1 hit for monomerid = 53582
TargetTyrosine-protein phosphatase non-receptor type 7(Homo sapiens (Human))
Burnham Center For Chemical Genomics
Curated by PubChem BioAssay
LigandPNGBDBM53582((1,3-dioxoisoindol-2-yl)methyl thiophene-2-carboxy...)
Affinity DataIC50:  1.00E+5nM. Assay description: Data Source: Sanford-Burnham Center for Chemical Genomics (SBCCG) Source Affiliation: Sanford-Burnham Medical Research Institute (SBMRI, San Diego, C...
In DepthDetails PCBioAssay