BDBM53584 MLS000110013::N-cycloheptyl-2,3,4,5,6-pentafluoro-benzamide::N-cycloheptyl-2,3,4,5,6-pentafluorobenzamide::N-cycloheptyl-2,3,4,5,6-pentakis(fluoranyl)benzamide::SMR000105946::cid_606840
SMILES Fc1c(F)c(F)c(C(=O)NC2CCCCCC2)c(F)c1F
InChI Key InChIKey=JMORWYMLHJSFMP-UHFFFAOYSA-N
Data  1 IC50
  Tab Delimited (TSV)   2D SDfile   Computed 3D by Vconf -m prep SDfile
Find this compound or compounds like it in BindingDB:
Activity Spreadsheet -- Enzyme Inhibition Constant Data from BindingDB
Found 1 hit for monomerid = 53584
TargetTyrosine-protein phosphatase non-receptor type 7(Homo sapiens (Human))
Burnham Center For Chemical Genomics
Curated by PubChem BioAssay
LigandPNGBDBM53584(MLS000110013 | N-cycloheptyl-2,3,4,5,6-pentafluoro...)
Affinity DataIC50:  1.00E+5nM. Assay description: Data Source: Sanford-Burnham Center for Chemical Genomics (SBCCG) Source Affiliation: Sanford-Burnham Medical Research Institute (SBMRI, San Diego, C...
In DepthDetails PCBioAssay