BDBM53633 1-methyl-3-nitro-4-phenoxy-2-quinolinone::1-methyl-3-nitro-4-phenoxy-carbostyril::1-methyl-3-nitro-4-phenoxy-quinolin-2-one::1-methyl-3-nitro-4-phenoxyquinolin-2-one::MLS000686997::SMR000283575::cid_779355
SMILES Cn1c2ccccc2c(Oc2ccccc2)c([N+]([O-])=O)c1=O
InChI Key InChIKey=QGTKOIGMIQIIBA-UHFFFAOYSA-N
Data  1 IC50
  Tab Delimited (TSV)   2D SDfile   Computed 3D by Vconf -m prep SDfile
Find this compound or compounds like it in BindingDB:
Activity Spreadsheet -- Enzyme Inhibition Constant Data from BindingDB
Found 1 hit for monomerid = 53633
TargetMannose-6-phosphate isomerase(Homo sapiens (Human))
Sanford-Burnham Center For Chemical Genomics
Curated by PubChem BioAssay
LigandPNGBDBM53633(1-methyl-3-nitro-4-phenoxy-2-quinolinone | 1-methy...)
Affinity DataIC50:  5.00E+4nM. Assay description: Data Source: Sanford-Burnham Center for Chemical Genomics (SBCCG) Source Affiliation: Sanford-Burnham Medical Research Institute (SBMRI, San Diego, C...
In DepthDetails PCBioAssay