BDBM53664 MLS000074723::N-[4-keto-2-(2-thenyl)quinazolin-3-yl]thiophene-2-carboxamide::N-[4-oxidanylidene-2-(thiophen-2-ylmethyl)quinazolin-3-yl]thiophene-2-carboxamide::N-[4-oxo-2-(thiophen-2-ylmethyl)-3-quinazolinyl]-2-thiophenecarboxamide::N-[4-oxo-2-(thiophen-2-ylmethyl)quinazolin-3-yl]thiophene-2-carboxamide::SMR000007496::Thiophene-2-carboxylic acid (4-oxo-2-thiophen-2-ylmethyl-4H-quinazolin-3-yl)-amide::cid_656220
SMILES O=C(Nn1c(Cc2cccs2)nc2ccccc2c1=O)c1cccs1
InChI Key InChIKey=FCBIYVMKAMUMGP-UHFFFAOYSA-N
Data  2 IC50
  Tab Delimited (TSV)   2D SDfile   Computed 3D by Vconf -m prep SDfile
Find this compound or compounds like it in BindingDB:
Activity Spreadsheet -- Enzyme Inhibition Constant Data from BindingDB
Found 2 hits for monomerid = 53664
TargetProcathepsin L(Homo sapiens (Human))
The Scripps Research Institute Molecular Screening Center
Curated by PubChem BioAssay
LigandPNGBDBM53664(MLS000074723 | N-[4-keto-2-(2-thenyl)quinazolin-3-...)
Affinity DataIC50: >5.96E+4nM. Assay description: Source (MLPCN Center Name): The Scripps Research Institute Molecular Screening Center Affiliation: The Scripps Research Institute, TSRI Assay Provide...
In DepthDetails PCBioAssay
TargetM1 family aminopeptidase(Plasmodium falciparum (isolate FcB1 / Columbia))
Srmlsc
Curated by PubChem BioAssay
LigandPNGBDBM53664(MLS000074723 | N-[4-keto-2-(2-thenyl)quinazolin-3-...)
Affinity DataIC50:  1.19E+4nM. Assay description: Southern Research Molecular Libraries Screening Center (SRMLSC) Southern Research Institute (Birmingham, Alabama) NIH Molecular Libraries Screening...
In DepthDetails PCBioAssay