BDBM53898 4-methyl-N-[4-oxidanyl-3-(1H-1,2,4-triazol-5-ylsulfanyl)phenyl]benzenesulfonamide::MLS000716201::N-[4-hydroxy-3-(1H-1,2,4-triazol-5-ylsulfanyl)phenyl]-4-methylbenzenesulfonamide::N-[4-hydroxy-3-(1H-1,2,4-triazol-5-ylthio)phenyl]-4-methyl-benzenesulfonamide::N-[4-hydroxy-3-(1H-1,2,4-triazol-5-ylthio)phenyl]-4-methylbenzenesulfonamide::SMR000277718::cid_1094878
SMILES Cc1ccc(cc1)S(=O)(=O)Nc1ccc(O)c(Sc2nnc[nH]2)c1
InChI Key InChIKey=ANDITESYZDMDFP-UHFFFAOYSA-N
Data  5 IC50
  Tab Delimited (TSV)   2D SDfile   Computed 3D by Vconf -m prep SDfile
Find this compound or compounds like it in BindingDB:
Activity Spreadsheet -- Enzyme Inhibition Constant Data from BindingDB
Found 5 hits for monomerid = 53898
TargetM1 family aminopeptidase(Plasmodium falciparum (isolate FcB1 / Columbia))
Srmlsc
Curated by PubChem BioAssay
LigandPNGBDBM53898(4-methyl-N-[4-oxidanyl-3-(1H-1,2,4-triazol-5-ylsul...)
Affinity DataIC50:  8.38E+4nM. Assay description: Southern Research Molecular Libraries Screening Center (SRMLSC) Southern Research Institute (Birmingham, Alabama) NIH Molecular Libraries Screening...
In DepthDetails PCBioAssay
TargetIntestinal-type alkaline phosphatase(Homo sapiens (Human))
Burnham Center For Chemical Genomics
Curated by PubChem BioAssay
LigandPNGBDBM53898(4-methyl-N-[4-oxidanyl-3-(1H-1,2,4-triazol-5-ylsul...)
Affinity DataIC50: >1.00E+5nM. Assay description: Data Source: Sanford-Burnham Center for Chemical Genomics (SBCCG) Source Affiliation: Sanford-Burnham Medical Research Institute(SBMRI, San Diego, CA...
In DepthDetails PCBioAssay
TargetIntestinal-type alkaline phosphatase 1(Rattus norvegicus (Rat))
Burnham Center For Chemical Genomics
Curated by PubChem BioAssay
LigandPNGBDBM53898(4-methyl-N-[4-oxidanyl-3-(1H-1,2,4-triazol-5-ylsul...)
Affinity DataIC50:  1.38E+4nM. Assay description: Data Source: Sanford-Burnham Center for Chemical Genomics (SBCCG) Source Affiliation: Sanford-Burnham Medical Research Institute (SBMRI, San Diego, C...
In DepthDetails PCBioAssay
TargetAlkaline phosphatase, tissue-nonspecific isozyme(Homo sapiens (Human))
Burnham Center For Chemical Genomics
Curated by PubChem BioAssay
LigandPNGBDBM53898(4-methyl-N-[4-oxidanyl-3-(1H-1,2,4-triazol-5-ylsul...)
Affinity DataIC50: >1.00E+5nM. Assay description: Data Source: Sanford-Burnham Center for Chemical Genomics (SBCCG) Source Affiliation: Sanford-Burnham Medical Research Institute (SBMRI, San Diego, C...
In DepthDetails PCBioAssay
TargetAlkaline phosphatase, germ cell type(Homo sapiens (Human))
Burnham Center For Chemical Genomics
Curated by PubChem BioAssay
LigandPNGBDBM53898(4-methyl-N-[4-oxidanyl-3-(1H-1,2,4-triazol-5-ylsul...)
Affinity DataIC50: >1.00E+5nM. Assay description: Data Source: Sanford-Burnham Center for Chemical Genomics (SBCCG) Source Affiliation: Sanford-Burnham Medical Research Institute (SBMRI, San Diego, C...
In DepthDetails PCBioAssay