BDBM53920 3-nitro-N-[3-(4-sulfamoylanilino)-2-quinoxalinyl]benzenesulfonamide::3-nitro-N-[3-(4-sulfamoylanilino)quinoxalin-2-yl]benzenesulfonamide::3-nitro-N-[3-[(4-sulfamoylphenyl)amino]quinoxalin-2-yl]benzenesulfonamide::MLS000714319::SMR000274299::cid_3113865
SMILES NS(=O)(=O)c1ccc(Nc2nc3ccccc3nc2NS(=O)(=O)c2cccc(c2)[N+]([O-])=O)cc1
InChI Key InChIKey=BBECLNISPGRBMN-UHFFFAOYSA-N
Data  2 IC50
  Tab Delimited (TSV)   2D SDfile   Computed 3D by Vconf -m prep SDfile
Find this compound or compounds like it in BindingDB:
Activity Spreadsheet -- Enzyme Inhibition Constant Data from BindingDB
Found 2 hits for monomerid = 53920
TargetGroup 3 secretory phospholipase A2(Homo sapiens)
The Scripps Research Institute Molecular Screening Center
Curated by PubChem BioAssay
LigandPNGBDBM53920(3-nitro-N-[3-(4-sulfamoylanilino)-2-quinoxalinyl]b...)
Affinity DataIC50:  4.25E+4nM. Assay description: Source (MLPCN Center Name): The Scripps Research Institute Molecular Screening Center Affiliation: The Scripps Research Institute, TSRI Assay Provide...
In DepthDetails PCBioAssay
TargetM1 family aminopeptidase(Plasmodium falciparum (isolate FcB1 / Columbia))
Srmlsc
Curated by PubChem BioAssay
LigandPNGBDBM53920(3-nitro-N-[3-(4-sulfamoylanilino)-2-quinoxalinyl]b...)
Affinity DataIC50:  4.29E+4nM. Assay description: Southern Research Molecular Libraries Screening Center (SRMLSC) Southern Research Institute (Birmingham, Alabama) NIH Molecular Libraries Screening...
In DepthDetails PCBioAssay