BDBM54031 5-carboxypentyl-[2-(4-methoxyphenyl)-6-methyl-1-benzopyran-4-ylidene]ammonium;perchlorate::5-carboxypentyl-[2-(4-methoxyphenyl)-6-methyl-chromen-4-ylidene]ammonium;perchlorate::5-carboxypentyl-[2-(4-methoxyphenyl)-6-methylchromen-4-ylidene]azanium;perchlorate::MLS000775774::SMR000369348::[2-(4-methoxyphenyl)-6-methyl-chromen-4-ylidene]-(6-oxidanyl-6-oxidanylidene-hexyl)azanium;perchlorate::cid_16196305
SMILES COc1ccc(cc1)-c1c\c(=[NH+]/CCCCCC(O)=O)c2cc(C)ccc2o1
InChI Key InChIKey=DWGXOZUYCCHVKE-HIXSDJFHSA-O
Data  1 IC50
  Tab Delimited (TSV)   2D SDfile   Computed 3D by Vconf -m prep SDfile
Find this compound or compounds like it in BindingDB:
Activity Spreadsheet -- Enzyme Inhibition Constant Data from BindingDB
Found 1 hit for monomerid = 54031
TargetM1 family aminopeptidase(Plasmodium falciparum (isolate FcB1 / Columbia))
Srmlsc
Curated by PubChem BioAssay
LigandPNGBDBM54031(5-carboxypentyl-[2-(4-methoxyphenyl)-6-methyl-1-be...)
Affinity DataIC50:  7.22E+3nM. Assay description: Southern Research Molecular Libraries Screening Center (SRMLSC) Southern Research Institute (Birmingham, Alabama) NIH Molecular Libraries Screening...
In DepthDetails PCBioAssay