BDBM54075 2-(1,3-Dioxo-1,3-dihydro-isoindol-2-yl)-4-methyl-pentanoic acid [4-(3,4-dimethyl-isoxazol-5-ylsulfamoyl)-phenyl]-amide::2-[1,3-bis(oxidanylidene)isoindol-2-yl]-N-[4-[(3,4-dimethyl-1,2-oxazol-5-yl)sulfamoyl]phenyl]-4-methyl-pentanamide::MLS000777039::N-[4-[(3,4-dimethyl-1,2-oxazol-5-yl)sulfamoyl]phenyl]-2-(1,3-dioxoisoindol-2-yl)-4-methylpentanamide::N-[4-[(3,4-dimethyl-5-isoxazolyl)sulfamoyl]phenyl]-2-(1,3-dioxo-2-isoindolyl)-4-methylpentanamide::N-[4-[(3,4-dimethylisoxazol-5-yl)sulfamoyl]phenyl]-4-methyl-2-phthalimido-valeramide::SMR000413426::cid_2788472
SMILES CC(C)CC(N1C(=O)c2ccccc2C1=O)C(=O)Nc1ccc(cc1)S(=O)(=O)Nc1onc(C)c1C
InChI Key InChIKey=RYIYZBJCEQYNPO-UHFFFAOYSA-N
Data  1 IC50
  Tab Delimited (TSV)   2D SDfile   Computed 3D by Vconf -m prep SDfile
Find this compound or compounds like it in BindingDB:
Activity Spreadsheet -- Enzyme Inhibition Constant Data from BindingDB
Found 1 hit for monomerid = 54075
TargetM1 family aminopeptidase(Plasmodium falciparum (isolate FcB1 / Columbia))
Srmlsc
Curated by PubChem BioAssay
LigandPNGBDBM54075(2-(1,3-Dioxo-1,3-dihydro-isoindol-2-yl)-4-methyl-p...)
Affinity DataIC50:  7.56E+3nM. Assay description: Southern Research Molecular Libraries Screening Center (SRMLSC) Southern Research Institute (Birmingham, Alabama) NIH Molecular Libraries Screening...
In DepthDetails PCBioAssay