BDBM54087 Isonicotinic acid [1-(5-bromo-2-hydroxy-phenyl)-meth-(E)-ylidene]-hydrazide::MLS000778139::N'-[(E)-(3-bromanyl-6-oxidanylidene-cyclohexa-2,4-dien-1-ylidene)methyl]pyridine-4-carbohydrazide::N'-[(E)-(3-bromo-6-keto-cyclohexa-2,4-dien-1-ylidene)methyl]isonicotinohydrazide::N'-[(E)-(3-bromo-6-oxo-1-cyclohexa-2,4-dienylidene)methyl]-4-pyridinecarbohydrazide::N'-[(E)-(3-bromo-6-oxocyclohexa-2,4-dien-1-ylidene)methyl]pyridine-4-carbohydrazide::SMR000414533::cid_5721425
SMILES Oc1ccc(Br)cc1C=NNC(=O)c1ccncc1
InChI Key InChIKey=UFNBDHGHPMABQB-UHFFFAOYSA-N
Data  1 IC50
  Tab Delimited (TSV)   2D SDfile   Computed 3D by Vconf -m prep SDfile
Find this compound or compounds like it in BindingDB:
Activity Spreadsheet -- Enzyme Inhibition Constant Data from BindingDB
Found 1 hit for monomerid = 54087
TargetM1 family aminopeptidase(Plasmodium falciparum (isolate FcB1 / Columbia))
Srmlsc
Curated by PubChem BioAssay
LigandPNGBDBM54087(Isonicotinic acid [1-(5-bromo-2-hydroxy-phenyl)-me...)
Affinity DataIC50:  7.95E+3nM. Assay description: Southern Research Molecular Libraries Screening Center (SRMLSC) Southern Research Institute (Birmingham, Alabama) NIH Molecular Libraries Screening...
In DepthDetails PCBioAssay