BDBM54152 Adenosine amine congener::MLS001056802::N-[3-[2-(2-aminoethylamino)-2-keto-ethyl]phenyl]-2-[4-[[9-[(2R,3R,4S,5R)-3,4-dihydroxy-5-methylol-tetrahydrofuran-2-yl]purin-6-yl]amino]phenyl]acetamide::N-[3-[2-(2-aminoethylamino)-2-oxoethyl]phenyl]-2-[4-[[9-[(2R,3R,4S,5R)-3,4-dihydroxy-5-(hydroxymethyl)-2-oxolanyl]-6-purinyl]amino]phenyl]acetamide::N-[3-[2-(2-aminoethylamino)-2-oxoethyl]phenyl]-2-[4-[[9-[(2R,3R,4S,5R)-3,4-dihydroxy-5-(hydroxymethyl)oxolan-2-yl]purin-6-yl]amino]phenyl]acetamide::N-[3-[2-(2-azanylethylamino)-2-oxidanylidene-ethyl]phenyl]-2-[4-[[9-[(2R,3R,4S,5R)-5-(hydroxymethyl)-3,4-bis(oxidanyl)oxolan-2-yl]purin-6-yl]amino]phenyl]ethanamide::SMR000326971::cid_16218845
SMILES NCCNC(=O)Cc1cccc(NC(=O)Cc2ccc(Nc3ncnc4n(cnc34)[C@@H]3O[C@H](CO)[C@@H](O)[C@H]3O)cc2)c1
InChI Key InChIKey=HVJGNAHENNXYLP-QZHHGCDDSA-N
Data  1 IC50
  Tab Delimited (TSV)   2D SDfile   Computed 3D by Vconf -m prep SDfile
Find this compound or compounds like it in BindingDB:
Activity Spreadsheet -- Enzyme Inhibition Constant Data from BindingDB
Found 1 hit for monomerid = 54152
TargetM1 family aminopeptidase(Plasmodium falciparum (isolate FcB1 / Columbia))
Srmlsc
Curated by PubChem BioAssay
LigandPNGBDBM54152(Adenosine amine congener | MLS001056802 | N-[3-[2-...)
Affinity DataIC50:  5.37E+4nM. Assay description: Southern Research Molecular Libraries Screening Center (SRMLSC) Southern Research Institute (Birmingham, Alabama) NIH Molecular Libraries Screening...
In DepthDetails PCBioAssay