BDBM54233 MLS000560896::N-(2,2-dichloro-1-tosyl-vinyl)-4-methyl-benzamide::N-[2,2-Dichloro-1-(toluene-4-sulfonyl)-vinyl]-4-methyl-benzamide::N-[2,2-bis(chloranyl)-1-(4-methylphenyl)sulfonyl-ethenyl]-4-methyl-benzamide::N-[2,2-dichloro-1-(4-methylphenyl)sulfonylethenyl]-4-methylbenzamide::SMR000173893::cid_1070709
SMILES [#6]-c1ccc(cc1)-[#6](=O)-[#7]\[#6](=[#6](/Cl)Cl)S(=O)(=O)c1ccc(-[#6])cc1
InChI Key InChIKey=MVLMQXKBXQKTRT-UHFFFAOYSA-N
Data  2 IC50  1 EC50
  Tab Delimited (TSV)   2D SDfile   Computed 3D by Vconf -m prep SDfile
Find this compound or compounds like it in BindingDB:
Activity Spreadsheet -- Enzyme Inhibition Constant Data from BindingDB
Found 3 hits for monomerid = 54233
TargetNucleotide-binding oligomerization domain-containing protein 2(Homo sapiens (Human))
Burnham Center For Chemical Genomics
Curated by PubChem BioAssay
LigandPNGBDBM54233(MLS000560896 | N-(2,2-dichloro-1-tosyl-vinyl)-4-me...)
Affinity DataIC50:  5.55E+3nM. Assay description: Data Source: Sanford-Burnham Center for Chemical Genomics (SBCCG) Source Affiliation: Sanford-Burnham Medical Research Institute (SBMRI, San Diego, C...
In DepthDetails PCBioAssay
TargetTumor necrosis factor(Homo sapiens (Human))
Burnham Center For Chemical Genomics
Curated by PubChem BioAssay
LigandPNGBDBM54233(MLS000560896 | N-(2,2-dichloro-1-tosyl-vinyl)-4-me...)
Affinity DataIC50:  6.28E+3nM. Assay description: Data Source: Sanford-Burnham Center for Chemical Genomics (SBCCG) Source Affiliation: Sanford-Burnham Medical Research Institute (SBMRI, San Diego, C...
In DepthDetails PCBioAssay
TargetNucleotide-binding oligomerization domain-containing protein 1(Homo sapiens (Human))
Burnham Center For Chemical Genomics
Curated by PubChem BioAssay
LigandPNGBDBM54233(MLS000560896 | N-(2,2-dichloro-1-tosyl-vinyl)-4-me...)
Affinity DataEC50:  2.46E+3nM. Assay description: Data Source: Sanford-Burnham Center for Chemical Genomics (SBCCG) Source Affiliation: Sanford-Burnham Medical Research Institute (SBMRI, San Diego, C...
In DepthDetails PCBioAssay