BDBM54241 MLS000585864::N-(2,4-dimethylphenyl)-9,10-bis(oxidanylidene)anthracene-2-sulfonamide::N-(2,4-dimethylphenyl)-9,10-diketo-anthracene-2-sulfonamide::N-(2,4-dimethylphenyl)-9,10-dioxo-2-anthracenesulfonamide::N-(2,4-dimethylphenyl)-9,10-dioxo-9,10-dihydroanthracene-2-sulfonamide::N-(2,4-dimethylphenyl)-9,10-dioxoanthracene-2-sulfonamide::SMR000207645::cid_7087395
SMILES Cc1ccc(NS(=O)(=O)c2ccc3C(=O)c4ccccc4C(=O)c3c2)c(C)c1
InChI Key InChIKey=YKKZJHWXDWCMIW-UHFFFAOYSA-N
Data  3 IC50  2 EC50
  Tab Delimited (TSV)   2D SDfile   Computed 3D by Vconf -m prep SDfile
Find this compound or compounds like it in BindingDB:
Activity Spreadsheet -- Enzyme Inhibition Constant Data from BindingDB
Found 5 hits for monomerid = 54241
TargetNucleotide-binding oligomerization domain-containing protein 2(Homo sapiens (Human))
Burnham Center For Chemical Genomics
Curated by PubChem BioAssay
LigandPNGBDBM54241(MLS000585864 | N-(2,4-dimethylphenyl)-9,10-bis(oxi...)
Affinity DataIC50:  6.68E+3nM. Assay description: Data Source: Sanford-Burnham Center for Chemical Genomics (SBCCG) Source Affiliation: Sanford-Burnham Medical Research Institute (SBMRI, San Diego, C...
In DepthDetails PCBioAssay
TargetNucleotide-binding oligomerization domain-containing protein 1(Homo sapiens (Human))
Burnham Center For Chemical Genomics
Curated by PubChem BioAssay
LigandPNGBDBM54241(MLS000585864 | N-(2,4-dimethylphenyl)-9,10-bis(oxi...)
Affinity DataEC50:  6.34E+3nM. Assay description: Data Source: Sanford-Burnham Center for Chemical Genomics (SBCCG) Source Affiliation: Sanford-Burnham Medical Research Institute (SBMRI, San Diego, C...
In DepthDetails PCBioAssay
TargetMitochondrial peptide methionine sulfoxide reductase(Bos taurus)
The Scripps Research Institute Molecular Screening Center
Curated by PubChem BioAssay
LigandPNGBDBM54241(MLS000585864 | N-(2,4-dimethylphenyl)-9,10-bis(oxi...)
Affinity DataIC50: >1.55E+5nM
In DepthDetails PCBioAssay
TargetMitochondrial peptide methionine sulfoxide reductase(Bos taurus)
The Scripps Research Institute Molecular Screening Center
Curated by PubChem BioAssay
LigandPNGBDBM54241(MLS000585864 | N-(2,4-dimethylphenyl)-9,10-bis(oxi...)
Affinity DataEC50: >1.04E+5nM. Assay description: Source (MLPCN Center Name): The Scripps Research Institute Molecular Screening Center (SRIMSC) Affiliation: The Scripps Research Institute, TSRI Assa...
In DepthDetails PCBioAssay
TargetTumor necrosis factor(Homo sapiens (Human))
Burnham Center For Chemical Genomics
Curated by PubChem BioAssay
LigandPNGBDBM54241(MLS000585864 | N-(2,4-dimethylphenyl)-9,10-bis(oxi...)
Affinity DataIC50:  7.68E+3nM. Assay description: Data Source: Sanford-Burnham Center for Chemical Genomics (SBCCG) Source Affiliation: Sanford-Burnham Medical Research Institute (SBMRI, San Diego, C...
In DepthDetails PCBioAssay