BDBM54289 (4E)-4-[[5-(4-chlorophenyl)sulfanylfuran-2-yl]methylidene]-1-phenyl-pyrazolidine-3,5-dione::(4E)-4-[[5-(4-chlorophenyl)sulfanylfuran-2-yl]methylidene]-1-phenylpyrazolidine-3,5-dione::(4E)-4-[[5-[(4-chlorophenyl)thio]-2-furanyl]methylidene]-1-phenylpyrazolidine-3,5-dione::(4E)-4-[[5-[(4-chlorophenyl)thio]-2-furyl]methylene]-1-phenyl-pyrazolidine-3,5-quinone::4-[1-[5-(4-Chloro-phenylsulfanyl)-furan-2-yl]-meth-(E)-ylidene]-1-phenyl-pyrazolidine-3,5-dione::MLS000587655::SMR000211645::cid_1611568
SMILES Clc1ccc(Sc2ccc(\C=C3/C(=O)NN(C3=O)c3ccccc3)o2)cc1
InChI Key InChIKey=GKWXPVYKHAXXOX-SFQUDFHCSA-N
Data  5 IC50  1 EC50
  Tab Delimited (TSV)   2D SDfile   Computed 3D by Vconf -m prep SDfile
Find this compound or compounds like it in BindingDB:
Activity Spreadsheet -- Enzyme Inhibition Constant Data from BindingDB
Found 6 hits for monomerid = 54289
TargetNucleotide-binding oligomerization domain-containing protein 2(Homo sapiens (Human))
Burnham Center For Chemical Genomics
Curated by PubChem BioAssay
LigandPNGBDBM54289((4E)-4-[[5-(4-chlorophenyl)sulfanylfuran-2-yl]meth...)
Affinity DataIC50:  1.47E+4nM. Assay description: Data Source: Sanford-Burnham Center for Chemical Genomics (SBCCG) Source Affiliation: Sanford-Burnham Medical Research Institute (SBMRI, San Diego, C...
In DepthDetails PCBioAssay
TargetNucleotide-binding oligomerization domain-containing protein 1(Homo sapiens (Human))
Burnham Center For Chemical Genomics
Curated by PubChem BioAssay
LigandPNGBDBM54289((4E)-4-[[5-(4-chlorophenyl)sulfanylfuran-2-yl]meth...)
Affinity DataEC50:  2.00E+4nM. Assay description: Data Source: Sanford-Burnham Center for Chemical Genomics (SBCCG) Source Affiliation: Sanford-Burnham Medical Research Institute (SBMRI, San Diego, C...
In DepthDetails PCBioAssay
TargetDNA damage-inducible transcript 3 protein(Mus musculus)
Emory University
Curated by PubChem BioAssay
LigandPNGBDBM54289((4E)-4-[[5-(4-chlorophenyl)sulfanylfuran-2-yl]meth...)
Affinity DataIC50:  4.39E+3nM. Assay description: NIH Molecular Libraries Screening Centers Network [MLSCN] Emory Chemical Biology Discovery Center in MLSCN Assay provider: Dr. Randal Kaufman, Univer...
In DepthDetails PCBioAssay
TargetDNA damage-inducible transcript 3 protein(Mus musculus)
Emory University
Curated by PubChem BioAssay
LigandPNGBDBM54289((4E)-4-[[5-(4-chlorophenyl)sulfanylfuran-2-yl]meth...)
Affinity DataIC50:  4.39E+3nM. Assay description: NIH Molecular Libraries Screening Centers Network [MLSCN] Emory Chemical Biology Discovery Center in MLSCN Assay provider: Dr. Randal Kaufman, Univer...
In DepthDetails PCBioAssay
TargetX-box-binding protein 1(Homo sapiens (Human))
Emory University
Curated by PubChem BioAssay
LigandPNGBDBM54289((4E)-4-[[5-(4-chlorophenyl)sulfanylfuran-2-yl]meth...)
Affinity DataIC50:  4.30E+3nM. Assay description: NIH Molecular Libraries Screening Centers Network [MLSCN] Emory Chemical Biology Discovery Center in MLSCN Assay provider: Dr. Randal Kaufman, Univer...
In DepthDetails PCBioAssay
TargetTumor necrosis factor(Homo sapiens (Human))
Burnham Center For Chemical Genomics
Curated by PubChem BioAssay
LigandPNGBDBM54289((4E)-4-[[5-(4-chlorophenyl)sulfanylfuran-2-yl]meth...)
Affinity DataIC50:  8.91E+3nM. Assay description: Data Source: Sanford-Burnham Center for Chemical Genomics (SBCCG) Source Affiliation: Sanford-Burnham Medical Research Institute (SBMRI, San Diego, C...
In DepthDetails PCBioAssay