BDBM54318 1-amyl-2-hydroxy-4-keto-N-(2-sulfamoylphenyl)quinoline-3-carboxamide::2-hydroxy-4-oxo-1-pentyl-N-(2-sulfamoylphenyl)-3-quinolinecarboxamide::2-hydroxy-4-oxo-1-pentyl-N-(2-sulfamoylphenyl)quinoline-3-carboxamide::2-oxidanyl-4-oxidanylidene-1-pentyl-N-(2-sulfamoylphenyl)quinoline-3-carboxamide::MLS000714262::SMR000274242::cid_1861643
SMILES CCCCCn1c2ccccc2c(O)c(C(=O)Nc2ccccc2S(N)(=O)=O)c1=O
InChI Key InChIKey=BDBVEOYSSZFSPG-UHFFFAOYSA-N
Data  5 IC50  1 EC50
  Tab Delimited (TSV)   2D SDfile   Computed 3D by Vconf -m prep SDfile
Find this compound or compounds like it in BindingDB:
Activity Spreadsheet -- Enzyme Inhibition Constant Data from BindingDB
Found 6 hits for monomerid = 54318
TargetNucleotide-binding oligomerization domain-containing protein 2(Homo sapiens (Human))
Burnham Center For Chemical Genomics
Curated by PubChem BioAssay
LigandPNGBDBM54318(1-amyl-2-hydroxy-4-keto-N-(2-sulfamoylphenyl)quino...)
Affinity DataIC50:  8.20E+3nM. Assay description: Data Source: Sanford-Burnham Center for Chemical Genomics (SBCCG) Source Affiliation: Sanford-Burnham Medical Research Institute (SBMRI, San Diego, C...
In DepthDetails PCBioAssay
TargetNucleotide-binding oligomerization domain-containing protein 1(Homo sapiens (Human))
Burnham Center For Chemical Genomics
Curated by PubChem BioAssay
LigandPNGBDBM54318(1-amyl-2-hydroxy-4-keto-N-(2-sulfamoylphenyl)quino...)
Affinity DataEC50:  6.17E+3nM. Assay description: Data Source: Sanford-Burnham Center for Chemical Genomics (SBCCG) Source Affiliation: Sanford-Burnham Medical Research Institute (SBMRI, San Diego, C...
In DepthDetails PCBioAssay
TargetTumor necrosis factor(Homo sapiens (Human))
Burnham Center For Chemical Genomics
Curated by PubChem BioAssay
LigandPNGBDBM54318(1-amyl-2-hydroxy-4-keto-N-(2-sulfamoylphenyl)quino...)
Affinity DataIC50:  2.00E+4nM. Assay description: Data Source: Sanford-Burnham Center for Chemical Genomics (SBCCG) Source Affiliation: Sanford-Burnham Medical Research Institute (SBMRI, San Diego, C...
In DepthDetails PCBioAssay
TargetNucleotide-binding oligomerization domain-containing protein 2(Homo sapiens (Human))
Burnham Center For Chemical Genomics
Curated by PubChem BioAssay
LigandPNGBDBM54318(1-amyl-2-hydroxy-4-keto-N-(2-sulfamoylphenyl)quino...)
Affinity DataIC50:  6.92E+3nM. Assay description: Data Source: Sanford-Burnham Center for Chemical Genomics (SBCCG) Source Affiliation: Sanford-Burnham Medical Research Institute (SBMRI, San Diego, C...
In DepthDetails PCBioAssay
TargetTumor necrosis factor(Homo sapiens (Human))
Burnham Center For Chemical Genomics
Curated by PubChem BioAssay
LigandPNGBDBM54318(1-amyl-2-hydroxy-4-keto-N-(2-sulfamoylphenyl)quino...)
Affinity DataIC50:  3.44E+3nM. Assay description: Data Source: Sanford-Burnham Center for Chemical Genomics (SBCCG) Source Affiliation: Sanford-Burnham Medical Research Institute (SBMRI, San Diego, C...
In DepthDetails PCBioAssay
TargetNucleotide-binding oligomerization domain-containing protein 1(Homo sapiens (Human))
Burnham Center For Chemical Genomics
Curated by PubChem BioAssay
LigandPNGBDBM54318(1-amyl-2-hydroxy-4-keto-N-(2-sulfamoylphenyl)quino...)
Affinity DataIC50:  5.88E+3nM. Assay description: Data Source: Sanford-Burnham Center for Chemical Genomics (SBCCG) Source Affiliation: Sanford-Burnham Medical Research Institute (SBMRI, San Diego, C...
In DepthDetails PCBioAssay