BDBM54330 1,3-dibenzyl-2-(4-methoxyphenyl)benzimidazol-3-ium;bromide::2-(4-methoxyphenyl)-1,3-bis(phenylmethyl)benzimidazol-3-ium;bromide::MLS000688421::SMR000284327::cid_16192864
SMILES COc1ccc(cc1)-c1n(Cc2ccccc2)c2ccccc2[n+]1Cc1ccccc1
InChI Key InChIKey=YWFDALCOUZEVSL-UHFFFAOYSA-N
Data  2 IC50  1 EC50
  Tab Delimited (TSV)   2D SDfile   Computed 3D by Vconf -m prep SDfile
Find this compound or compounds like it in BindingDB:
Activity Spreadsheet -- Enzyme Inhibition Constant Data from BindingDB
Found 3 hits for monomerid = 54330
TargetNucleotide-binding oligomerization domain-containing protein 2(Homo sapiens (Human))
Burnham Center For Chemical Genomics
Curated by PubChem BioAssay
LigandPNGBDBM54330(1,3-dibenzyl-2-(4-methoxyphenyl)benzimidazol-3-ium...)
Affinity DataIC50:  3.69E+3nM. Assay description: Data Source: Sanford-Burnham Center for Chemical Genomics (SBCCG) Source Affiliation: Sanford-Burnham Medical Research Institute (SBMRI, San Diego, C...
In DepthDetails PCBioAssay
TargetTumor necrosis factor(Homo sapiens (Human))
Burnham Center For Chemical Genomics
Curated by PubChem BioAssay
LigandPNGBDBM54330(1,3-dibenzyl-2-(4-methoxyphenyl)benzimidazol-3-ium...)
Affinity DataIC50:  1.21E+3nM. Assay description: Data Source: Sanford-Burnham Center for Chemical Genomics (SBCCG) Source Affiliation: Sanford-Burnham Medical Research Institute (SBMRI, San Diego, C...
In DepthDetails PCBioAssay
TargetNucleotide-binding oligomerization domain-containing protein 1(Homo sapiens (Human))
Burnham Center For Chemical Genomics
Curated by PubChem BioAssay
LigandPNGBDBM54330(1,3-dibenzyl-2-(4-methoxyphenyl)benzimidazol-3-ium...)
Affinity DataEC50:  4.23E+3nM. Assay description: Data Source: Sanford-Burnham Center for Chemical Genomics (SBCCG) Source Affiliation: Sanford-Burnham Medical Research Institute (SBMRI, San Diego, C...
In DepthDetails PCBioAssay