BDBM54393 2,2-dimethyl-N-[N'-(5-methyl-1,3-benzoxazol-2-yl)amidino]propionamide::2,2-dimethyl-N-[N'-(5-methyl-1,3-benzoxazol-2-yl)carbamimidoyl]propanamide::MLS000767476::N-(2,2-Dimethyl-propionyl)-N'-(5-methyl-benzooxazol-2-yl)-guanidine::N-[amino-[(5-methyl-1,3-benzoxazol-2-yl)imino]methyl]-2,2-dimethylpropanamide::SMR000429824::cid_3390551
SMILES Cc1ccc2oc(N=C(N)NC(=O)C(C)(C)C)nc2c1
InChI Key InChIKey=FEGRDSCRSPKTQN-UHFFFAOYSA-N
Data  4 IC50  2 EC50
  Tab Delimited (TSV)   2D SDfile   Computed 3D by Vconf -m prep SDfile
Find this compound or compounds like it in BindingDB:
Activity Spreadsheet -- Enzyme Inhibition Constant Data from BindingDB
Found 6 hits for monomerid = 54393
TargetNucleotide-binding oligomerization domain-containing protein 2(Homo sapiens (Human))
Burnham Center For Chemical Genomics
Curated by PubChem BioAssay
LigandPNGBDBM54393(2,2-dimethyl-N-[N'-(5-methyl-1,3-benzoxazol-2-yl)a...)
Affinity DataIC50:  4.71E+3nM. Assay description: Data Source: Sanford-Burnham Center for Chemical Genomics (SBCCG) Source Affiliation: Sanford-Burnham Medical Research Institute (SBMRI, San Diego, C...
In DepthDetails PCBioAssay
TargetNucleotide-binding oligomerization domain-containing protein 1(Homo sapiens (Human))
Burnham Center For Chemical Genomics
Curated by PubChem BioAssay
LigandPNGBDBM54393(2,2-dimethyl-N-[N'-(5-methyl-1,3-benzoxazol-2-yl)a...)
Affinity DataEC50:  310nM. Assay description: Data Source: Sanford-Burnham Center for Chemical Genomics (SBCCG) Source Affiliation: Sanford-Burnham Medical Research Institute (SBMRI, San Diego, C...
In DepthDetails PCBioAssay
TargetTumor necrosis factor(Homo sapiens (Human))
Burnham Center For Chemical Genomics
Curated by PubChem BioAssay
LigandPNGBDBM54393(2,2-dimethyl-N-[N'-(5-methyl-1,3-benzoxazol-2-yl)a...)
Affinity DataIC50:  313nM. Assay description: Data Source: Sanford-Burnham Center for Chemical Genomics (SBCCG) Source Affiliation: Sanford-Burnham Medical Research Institute (SBMRI, San Diego, C...
In DepthDetails PCBioAssay
TargetTumor necrosis factor(Homo sapiens (Human))
Burnham Center For Chemical Genomics
Curated by PubChem BioAssay
LigandPNGBDBM54393(2,2-dimethyl-N-[N'-(5-methyl-1,3-benzoxazol-2-yl)a...)
Affinity DataIC50: <39.1nM. Assay description: Data Source: Sanford-Burnham Center for Chemical Genomics (SBCCG) Source Affiliation: Sanford-Burnham Medical Research Institute (SBMRI, San Diego, C...
In DepthDetails PCBioAssay
TargetHeat shock factor protein 1(Mus musculus)
Broad Institute
Curated by PubChem BioAssay
LigandPNGBDBM54393(2,2-dimethyl-N-[N'-(5-methyl-1,3-benzoxazol-2-yl)a...)
Affinity DataEC50: <160nM. Assay description: Keywords: Heat Shock Factor-1 (HSF-1), Stress Response, MG132, NIH3T3, Luminescence Assay Overview: Modified NIH3T3, transformed to express firefly...
In DepthDetails PCBioAssay
TargetNucleotide-binding oligomerization domain-containing protein 1(Homo sapiens (Human))
Burnham Center For Chemical Genomics
Curated by PubChem BioAssay
LigandPNGBDBM54393(2,2-dimethyl-N-[N'-(5-methyl-1,3-benzoxazol-2-yl)a...)
Affinity DataIC50:  94.9nM. Assay description: Data Source: Sanford-Burnham Center for Chemical Genomics (SBCCG) Source Affiliation: Sanford-Burnham Medical Research Institute (SBMRI, San Diego, C...
In DepthDetails PCBioAssay