BDBM54425 1-[1-(4-Acetyl-phenyl)-5-hydroxy-2-methyl-1H-indol-3-yl]-ethanone::1-[4-(3-acetyl-5-hydroxy-2-methyl-1-indolyl)phenyl]ethanone::1-[4-(3-acetyl-5-hydroxy-2-methyl-indol-1-yl)phenyl]ethanone::1-[4-(3-acetyl-5-hydroxy-2-methylindol-1-yl)phenyl]ethanone::1-[4-(3-ethanoyl-2-methyl-5-oxidanyl-indol-1-yl)phenyl]ethanone::MLS001207046::SMR000523521::cid_753262
SMILES CC(=O)c1c(C)n(-c2ccc(cc2)C(C)=O)c2ccc(O)cc12
InChI Key InChIKey=LNLYLQCNEVJCPJ-UHFFFAOYSA-N
Data  2 IC50  1 EC50
  Tab Delimited (TSV)   2D SDfile   Computed 3D by Vconf -m prep SDfile
Find this compound or compounds like it in BindingDB:
Activity Spreadsheet -- Enzyme Inhibition Constant Data from BindingDB
Found 3 hits for monomerid = 54425
TargetNucleotide-binding oligomerization domain-containing protein 2(Homo sapiens (Human))
Burnham Center For Chemical Genomics
Curated by PubChem BioAssay
LigandPNGBDBM54425(1-[1-(4-Acetyl-phenyl)-5-hydroxy-2-methyl-1H-indol...)
Affinity DataIC50:  2.70E+3nM. Assay description: Data Source: Sanford-Burnham Center for Chemical Genomics (SBCCG) Source Affiliation: Sanford-Burnham Medical Research Institute (SBMRI, San Diego, C...
In DepthDetails PCBioAssay
TargetTumor necrosis factor(Homo sapiens (Human))
Burnham Center For Chemical Genomics
Curated by PubChem BioAssay
LigandPNGBDBM54425(1-[1-(4-Acetyl-phenyl)-5-hydroxy-2-methyl-1H-indol...)
Affinity DataIC50:  1.94E+3nM. Assay description: Data Source: Sanford-Burnham Center for Chemical Genomics (SBCCG) Source Affiliation: Sanford-Burnham Medical Research Institute (SBMRI, San Diego, C...
In DepthDetails PCBioAssay
TargetNucleotide-binding oligomerization domain-containing protein 1(Homo sapiens (Human))
Burnham Center For Chemical Genomics
Curated by PubChem BioAssay
LigandPNGBDBM54425(1-[1-(4-Acetyl-phenyl)-5-hydroxy-2-methyl-1H-indol...)
Affinity DataEC50:  2.00E+4nM. Assay description: Data Source: Sanford-Burnham Center for Chemical Genomics (SBCCG) Source Affiliation: Sanford-Burnham Medical Research Institute (SBMRI, San Diego, C...
In DepthDetails PCBioAssay