BDBM54506 5-chloranyl-N-(4-fluorophenyl)-2-[(2-methylphenyl)methylsulfonyl]pyrimidine-4-carboxamide::5-chloro-N-(4-fluorophenyl)-2-(2-methylbenzyl)sulfonyl-pyrimidine-4-carboxamide::5-chloro-N-(4-fluorophenyl)-2-[(2-methylphenyl)methylsulfonyl]-4-pyrimidinecarboxamide::5-chloro-N-(4-fluorophenyl)-2-[(2-methylphenyl)methylsulfonyl]pyrimidine-4-carboxamide::MLS001116168::SMR000625791::cid_16452954
SMILES Cc1ccccc1CS(=O)(=O)c1ncc(Cl)c(n1)C(=O)Nc1ccc(F)cc1
InChI Key InChIKey=LIEQNFQFBUWUFS-UHFFFAOYSA-N
Data  8 IC50  1 EC50
  Tab Delimited (TSV)   2D SDfile   Computed 3D by Vconf -m prep SDfile
Find this compound or compounds like it in BindingDB:
Activity Spreadsheet -- Enzyme Inhibition Constant Data from BindingDB
Found 9 hits for monomerid = 54506
TargetNucleotide-binding oligomerization domain-containing protein 2(Homo sapiens (Human))
Burnham Center For Chemical Genomics
Curated by PubChem BioAssay
LigandPNGBDBM54506(5-chloranyl-N-(4-fluorophenyl)-2-[(2-methylphenyl)...)
Affinity DataIC50:  1.00E+4nM. Assay description: Data Source: Sanford-Burnham Center for Chemical Genomics (SBCCG) Source Affiliation: Sanford-Burnham Medical Research Institute (SBMRI, San Diego, C...
In DepthDetails PCBioAssay
TargetNucleotide-binding oligomerization domain-containing protein 1(Homo sapiens (Human))
Burnham Center For Chemical Genomics
Curated by PubChem BioAssay
LigandPNGBDBM54506(5-chloranyl-N-(4-fluorophenyl)-2-[(2-methylphenyl)...)
Affinity DataEC50:  8.92E+3nM. Assay description: Data Source: Sanford-Burnham Center for Chemical Genomics (SBCCG) Source Affiliation: Sanford-Burnham Medical Research Institute (SBMRI, San Diego, C...
In DepthDetails PCBioAssay
TargetTumor necrosis factor(Homo sapiens (Human))
Burnham Center For Chemical Genomics
Curated by PubChem BioAssay
LigandPNGBDBM54506(5-chloranyl-N-(4-fluorophenyl)-2-[(2-methylphenyl)...)
Affinity DataIC50:  9.14E+3nM. Assay description: Data Source: Sanford-Burnham Center for Chemical Genomics (SBCCG) Source Affiliation: Sanford-Burnham Medical Research Institute (SBMRI, San Diego, C...
In DepthDetails PCBioAssay
TargetBeta-galactosidase(Escherichia coli)
Burnham Center For Chemical Genomics
Curated by PubChem BioAssay
LigandPNGBDBM54506(5-chloranyl-N-(4-fluorophenyl)-2-[(2-methylphenyl)...)
Affinity DataIC50: >6.66E+4nM. Assay description: Data Source: Sanford-Burnham Center for Chemical Genomics (SBCCG) Source Affiliation: Sanford-Burnham Medical Research Institute(SBMRI, San Diego, C...
In DepthDetails PCBioAssay
TargetBeta-lactamase(Pseudomonas aeruginosa)
The Scripps Research Institute Molecular Screening Center
Curated by PubChem BioAssay
LigandPNGBDBM54506(5-chloranyl-N-(4-fluorophenyl)-2-[(2-methylphenyl)...)
Affinity DataIC50:  6.25E+3nM. Assay description: Source (MLPCN Center Name): The Scripps Research Institute Molecular Screening Center (SRIMSC) Affiliation: The Scripps Research Institute, TSRI Assa...
In DepthDetails PCBioAssay
TargetApelin receptor(Homo sapiens (Human))
Burnham Center For Chemical Genomics
Curated by PubChem BioAssay
LigandPNGBDBM54506(5-chloranyl-N-(4-fluorophenyl)-2-[(2-methylphenyl)...)
Affinity DataIC50:  1.97E+4nM. Assay description: Data Source: Sanford-Burnham Center for Chemical Genomics (SBCCG) Source Affiliation: Sanford-Burnham Medical Research Institute(SBMRI, San Diego, CA...
In DepthDetails PCBioAssay
TargetC-C chemokine receptor type 6(Homo sapiens (Human))
Burnham Center For Chemical Genomics
Curated by PubChem BioAssay
LigandPNGBDBM54506(5-chloranyl-N-(4-fluorophenyl)-2-[(2-methylphenyl)...)
Affinity DataIC50:  1.67E+4nM. Assay description: Data Source: Sanford-Burnham Center for Chemical Genomics (SBCCG) Source Affiliation: Sanford-Burnham Medical Research Institute(SBMRI, San Diego, CA...
In DepthDetails PCBioAssay
TargetToll-like receptor 9(Homo sapiens (Human))
The Scripps Research Institute Molecular Screening Center
Curated by PubChem BioAssay
LigandPNGBDBM54506(5-chloranyl-N-(4-fluorophenyl)-2-[(2-methylphenyl)...)
Affinity DataIC50:  1.10E+4nM. Assay description: Source (MLPCN Center Name): The Scripps Research Institute Molecular Screening Center (SRIMSC) Affiliation: The Scripps Research Institute, TSRI Assa...
In DepthDetails PCBioAssay
TargetC-C chemokine receptor type 6(Homo sapiens (Human))
Burnham Center For Chemical Genomics
Curated by PubChem BioAssay
LigandPNGBDBM54506(5-chloranyl-N-(4-fluorophenyl)-2-[(2-methylphenyl)...)
Affinity DataIC50:  2.45E+4nM. Assay description: Data Source: Sanford-Burnham Center for Chemical Genomics (SBCCG) Source Affiliation: Sanford-Burnham Medical Research Institute(SBMRI, San Diego, CA...
In DepthDetails PCBioAssay