BDBM54564 3-[3-(3-chlorophenyl)-1,2,4-oxadiazol-5-yl]-1-[4-(2,5-dimethylphenyl)-1-piperazinyl]-1-propanone::3-[3-(3-chlorophenyl)-1,2,4-oxadiazol-5-yl]-1-[4-(2,5-dimethylphenyl)piperazin-1-yl]propan-1-one::3-[3-(3-chlorophenyl)-1,2,4-oxadiazol-5-yl]-1-[4-(2,5-dimethylphenyl)piperazino]propan-1-one::KUC103376N::UNM-0000306086::cid_42596911
SMILES Cc1ccc(C)c(c1)N1CCN(CC1)C(=O)CCc1nc(no1)-c1cccc(Cl)c1
InChI Key InChIKey=KATPHVJGPVMLKM-UHFFFAOYSA-N
Data  5 KI  8 EC50
  Tab Delimited (TSV)   2D SDfile   Computed 3D by Vconf -m prep SDfile
Find this compound or compounds like it in BindingDB:
Activity Spreadsheet -- Enzyme Inhibition Constant Data from BindingDB
Found 13 hits for monomerid = 54564
TargetRas-related protein Rab-2A(Canis lupus familiaris)
Nmmlsc
Curated by PubChem BioAssay
LigandPNGBDBM54564(3-[3-(3-chlorophenyl)-1,2,4-oxadiazol-5-yl]-1-[4-(...)
Affinity DataKi:  180nM. Assay description: University of New Mexico Assay Overview: Assay Support: NIH I RO3 MH081231-01 HTS to identify specific small molecule inhibitors of Ras and Ras-rela...
In DepthDetails PCBioAssay
TargetCell division control protein 42 homolog(Homo sapiens (Human))
Nmmlsc
Curated by PubChem BioAssay
LigandPNGBDBM54564(3-[3-(3-chlorophenyl)-1,2,4-oxadiazol-5-yl]-1-[4-(...)
Affinity DataKi:  460nM. Assay description: University of New Mexico Assay Overview: Assay Support: NIH I RO3 MH081231-01 HTS to identify specific small molecule inhibitors of Ras and Ras-rela...
In DepthDetails PCBioAssay
LigandPNGBDBM54564(3-[3-(3-chlorophenyl)-1,2,4-oxadiazol-5-yl]-1-[4-(...)
Affinity DataKi:  460nM. Assay description: University of New Mexico Assay Overview: Assay Support: NIH I RO3 MH081231-01 HTS to identify specific small molecule inhibitors of Ras and Ras-rela...
In DepthDetails PCBioAssay
LigandPNGBDBM54564(3-[3-(3-chlorophenyl)-1,2,4-oxadiazol-5-yl]-1-[4-(...)
Affinity DataKi:  470nM. Assay description: University of New Mexico Assay Overview: Assay Support: NIH I RO3 MH081231-01 HTS to identify specific small molecule inhibitors of Ras and Ras-rela...
In DepthDetails PCBioAssay
TargetCell division control protein 42 homolog(Homo sapiens (Human))
Nmmlsc
Curated by PubChem BioAssay
LigandPNGBDBM54564(3-[3-(3-chlorophenyl)-1,2,4-oxadiazol-5-yl]-1-[4-(...)
Affinity DataKi:  600nM. Assay description: University of New Mexico Assay Overview: Assay Support: NIH I RO3 MH081231-01 HTS to identify specific small molecule inhibitors of Ras and Ras-rela...
In DepthDetails PCBioAssay
TargetCell division control protein 42 homolog(Homo sapiens (Human))
Nmmlsc
Curated by PubChem BioAssay
LigandPNGBDBM54564(3-[3-(3-chlorophenyl)-1,2,4-oxadiazol-5-yl]-1-[4-(...)
Affinity DataEC50:  2.18E+3nM. Assay description: University of New Mexico Assay Overview: Assay Support: NIH I RO3 MH081231-01 HTS to identify specific small molecule inhibitors of Ras and Ras-rela...
In DepthDetails PCBioAssay
TargetGTPase KRas [1-37](Homo sapiens (Human))
Nmmlsc
Curated by PubChem BioAssay
LigandPNGBDBM54564(3-[3-(3-chlorophenyl)-1,2,4-oxadiazol-5-yl]-1-[4-(...)
Affinity DataEC50:  3.00E+4nM. Assay description: University of New Mexico Assay Overview: Assay Support: NIH I RO3 MH081231-01 HTS to identify specific small molecule inhibitors of Ras and Ras-rela...
In DepthDetails PCBioAssay
TargetRas-related protein Rab-2A(Canis lupus familiaris)
Nmmlsc
Curated by PubChem BioAssay
LigandPNGBDBM54564(3-[3-(3-chlorophenyl)-1,2,4-oxadiazol-5-yl]-1-[4-(...)
Affinity DataEC50:  2.90E+3nM. Assay description: University of New Mexico Assay Overview: Assay Support: NIH I RO3 MH081231-01 HTS to identify specific small molecule inhibitors of Ras and Ras-rela...
In DepthDetails PCBioAssay
TargetCell division control protein 42 homolog(Homo sapiens (Human))
Nmmlsc
Curated by PubChem BioAssay
LigandPNGBDBM54564(3-[3-(3-chlorophenyl)-1,2,4-oxadiazol-5-yl]-1-[4-(...)
Affinity DataEC50:  3.91E+3nM. Assay description: University of New Mexico Assay Overview: Assay Support: NIH I RO3 MH081231-01 HTS to identify specific small molecule inhibitors of Ras and Ras-rela...
In DepthDetails PCBioAssay
LigandPNGBDBM54564(3-[3-(3-chlorophenyl)-1,2,4-oxadiazol-5-yl]-1-[4-(...)
Affinity DataEC50:  4.97E+3nM. Assay description: University of New Mexico Assay Overview: Assay Support: NIH I RO3 MH081231-01 HTS to identify specific small molecule inhibitors of Ras and Ras-rela...
In DepthDetails PCBioAssay
TargetGTPase KRas [1-37](Homo sapiens (Human))
Nmmlsc
Curated by PubChem BioAssay
LigandPNGBDBM54564(3-[3-(3-chlorophenyl)-1,2,4-oxadiazol-5-yl]-1-[4-(...)
Affinity DataEC50:  3.00E+4nM. Assay description: University of New Mexico Assay Overview: Assay Support: NIH I RO3 MH081231-01 HTS to identify specific small molecule inhibitors of Ras and Ras-rela...
In DepthDetails PCBioAssay
LigandPNGBDBM54564(3-[3-(3-chlorophenyl)-1,2,4-oxadiazol-5-yl]-1-[4-(...)
Affinity DataEC50:  5.12E+3nM. Assay description: University of New Mexico Assay Overview: Assay Support: NIH I RO3 MH081231-01 HTS to identify specific small molecule inhibitors of Ras and Ras-rela...
In DepthDetails PCBioAssay
TargetRas-related protein Rab-7a(Canis lupus familiaris)
Nmmlsc
Curated by PubChem BioAssay
LigandPNGBDBM54564(3-[3-(3-chlorophenyl)-1,2,4-oxadiazol-5-yl]-1-[4-(...)
Affinity DataEC50:  3.00E+4nM. Assay description: University of New Mexico Assay Overview: Assay Support: NIH I RO3 MH081231-01 HTS to identify specific small molecule inhibitors of Ras and Ras-rela...
In DepthDetails PCBioAssay