BDBM54727 (2Z,3E)-2-(4-butylbenzylidene)-3-[ethoxy(hydroxy)methylene]tetralin-1,4-quinone::(2Z,3E)-2-[(4-butylphenyl)methylidene]-3-[ethoxy(hydroxy)methylidene]naphthalene-1,4-dione::(2Z,3E)-2-[(4-butylphenyl)methylidene]-3-[ethoxy(oxidanyl)methylidene]naphthalene-1,4-dione::MLS000571348::SMR000193433::cid_5337196::ethyl 3-(4-butylbenzylidene)-1-hydroxy-4-oxo-3,4-dihydro-2-naphthalenecarboxylate
SMILES CCCCc1ccc(CC2=C(C(=O)OCC)C(=O)c3ccccc3C2=O)cc1
InChI Key InChIKey=PZHHWMVJZNQARN-UHFFFAOYSA-N
Data  3 IC50
  Tab Delimited (TSV)   2D SDfile   Computed 3D by Vconf -m prep SDfile
Find this compound or compounds like it in BindingDB:
Activity Spreadsheet -- Enzyme Inhibition Constant Data from BindingDB
Found 3 hits for monomerid = 54727
TargetAmyloid-beta A4 precursor protein-binding family A member 1(Rattus norvegicus)
Burnham Center For Chemical Genomics
Curated by PubChem BioAssay
LigandPNGBDBM54727((2Z,3E)-2-(4-butylbenzylidene)-3-[ethoxy(hydroxy)m...)
Affinity DataIC50:  5.63E+3nM. Assay description: Data Source: Sanford-Burnham Center for Chemical Genomics (SBCCG) Source Affiliation: Sanford-Burnham Medical Research Institute (SBMRI, San Diego, C...
In DepthDetails PCBioAssay
TargetAmyloid-beta A4 precursor protein-binding family A member 1(Rattus norvegicus)
Burnham Center For Chemical Genomics
Curated by PubChem BioAssay
LigandPNGBDBM54727((2Z,3E)-2-(4-butylbenzylidene)-3-[ethoxy(hydroxy)m...)
Affinity DataIC50:  1.62E+4nM. Assay description: Data Source: Sanford-Burnham Center for Chemical Genomics (SBCCG) Source Affiliation: Sanford-Burnham Medical Research Institute (SBMRI, San Diego, C...
In DepthDetails PCBioAssay
TargetVoltage-dependent N-type calcium channel subunit alpha-1B(Homo sapiens (Human))
Burnham Center For Chemical Genomics
Curated by PubChem BioAssay
LigandPNGBDBM54727((2Z,3E)-2-(4-butylbenzylidene)-3-[ethoxy(hydroxy)m...)
Affinity DataIC50:  1.78E+4nM. Assay description: Data Source: Data Source: Sanford-Burnham Center for Chemical Genomics (SBCCG) Source Affiliation: Sanford-Burnham Medical Research Institute Network...
In DepthDetails PCBioAssay