BDBM54752 (E)-N-cyclohexyl-3-(4-nitrophenyl)-N-(2-pyridinyl)-2-propenamide::(E)-N-cyclohexyl-3-(4-nitrophenyl)-N-(2-pyridyl)acrylamide::(E)-N-cyclohexyl-3-(4-nitrophenyl)-N-pyridin-2-yl-prop-2-enamide::(E)-N-cyclohexyl-3-(4-nitrophenyl)-N-pyridin-2-ylprop-2-enamide::MLS001013386::SMR000385264::cid_5682438
SMILES [O-][N+](=O)c1ccc(\C=C\C(=O)N(C2CCCCC2)c2ccccn2)cc1
InChI Key InChIKey=GMQINCPJVNSAKW-SDNWHVSQSA-N
Data  2 IC50
  Tab Delimited (TSV)   2D SDfile   Computed 3D by Vconf -m prep SDfile
Find this compound or compounds like it in BindingDB:
Activity Spreadsheet -- Enzyme Inhibition Constant Data from BindingDB
Found 2 hits for monomerid = 54752
TargetVoltage-dependent N-type calcium channel subunit alpha-1B(Homo sapiens (Human))
Burnham Center For Chemical Genomics
Curated by PubChem BioAssay
LigandPNGBDBM54752((E)-N-cyclohexyl-3-(4-nitrophenyl)-N-(2-pyridinyl)...)
Affinity DataIC50:  1.05E+4nM. Assay description: Data Source: Data Source: Sanford-Burnham Center for Chemical Genomics (SBCCG) Source Affiliation: Sanford-Burnham Medical Research Institute Network...
In DepthDetails PCBioAssay
TargetAmyloid-beta A4 precursor protein-binding family A member 1(Rattus norvegicus)
Burnham Center For Chemical Genomics
Curated by PubChem BioAssay
LigandPNGBDBM54752((E)-N-cyclohexyl-3-(4-nitrophenyl)-N-(2-pyridinyl)...)
Affinity DataIC50:  2.91E+4nM. Assay description: Data Source: Sanford-Burnham Center for Chemical Genomics (SBCCG) Source Affiliation: Sanford-Burnham Medical Research Institute (SBMRI, San Diego, C...
In DepthDetails PCBioAssay