BDBM54852 2-methyl-N-[(E)-(2-phenyl-2,3-dihydrochromen-4-ylidene)amino]propan-2-amine::2-methyl-N-[(E)-(2-phenyl-3,4-dihydro-2H-1-benzopyran-4-ylidene)amino]-2-propanamine::BRD-A92251157-003-01-0::cid_16240206::tert-butyl-[(2-phenylchroman-4-ylidene)amino]amine;hydrochloride::tert-butyl-[(E)-(2-phenylchroman-4-ylidene)amino]amine
SMILES CC(C)(C)NN=C1CC(Oc2ccccc12)c1ccccc1
InChI Key InChIKey=VHROBQTXHXDELU-UHFFFAOYSA-N
Data  2 EC50
  Tab Delimited (TSV)   2D SDfile   Computed 3D by Vconf -m prep SDfile
Find this compound or compounds like it in BindingDB:
Activity Spreadsheet -- Enzyme Inhibition Constant Data from BindingDB
Found 2 hits for monomerid = 54852
TargetStreptokinase A(Streptococcus pyogenes M1 GAS)
Broad Institute
Curated by PubChem BioAssay
LigandPNGBDBM54852(2-methyl-N-[(E)-(2-phenyl-2,3-dihydrochromen-4-yli...)
Affinity DataEC50:  7.08E+3nM. Assay description: Keywords: Group A streptococcus, GAS, streptokinase, expression, virulence, inhibition, dose response, EC50 Assay Overview: The goal of this assa...
In DepthDetails PCBioAssay
TargetStreptokinase A(Streptococcus pyogenes M1 GAS)
Broad Institute
Curated by PubChem BioAssay
LigandPNGBDBM54852(2-methyl-N-[(E)-(2-phenyl-2,3-dihydrochromen-4-yli...)
Affinity DataEC50:  7.95E+3nM. Assay description: Keywords: Group A streptococcus, GAS, streptokinase, expression, virulence, inhibition, dose response, EC50 Assay Overview: The goal of this assa...
In DepthDetails PCBioAssay