BDBM54859 5-ethyl-2-(2-thenoylamino)-4-(2-thienyl)thiophene-3-carboxylic acid ethyl ester::5-ethyl-2-[[oxo(thiophen-2-yl)methyl]amino]-4-thiophen-2-yl-3-thiophenecarboxylic acid ethyl ester::BRD-K08667472-001-04-4::cid_1251203::ethyl 5-ethyl-2-(thiophene-2-carbonylamino)-4-thiophen-2-ylthiophene-3-carboxylate::ethyl 5-ethyl-4-thiophen-2-yl-2-(thiophen-2-ylcarbonylamino)thiophene-3-carboxylate
SMILES CCOC(=O)c1c(NC(=O)c2cccs2)sc(CC)c1-c1cccs1
InChI Key InChIKey=BCDLCNCAEWYMNQ-UHFFFAOYSA-N
Data  2 EC50
  Tab Delimited (TSV)   2D SDfile   Computed 3D by Vconf -m prep SDfile
Find this compound or compounds like it in BindingDB:
Activity Spreadsheet -- Enzyme Inhibition Constant Data from BindingDB
Found 2 hits for monomerid = 54859
TargetStreptokinase A(Streptococcus pyogenes M1 GAS)
Broad Institute
Curated by PubChem BioAssay
LigandPNGBDBM54859(5-ethyl-2-(2-thenoylamino)-4-(2-thienyl)thiophene-...)
Affinity DataEC50:  9.89E+3nM. Assay description: Keywords: Group A streptococcus, GAS, streptokinase, expression, virulence, inhibition, dose response, EC50 Assay Overview: The goal of this assa...
In DepthDetails PCBioAssay
TargetStreptokinase A(Streptococcus pyogenes M1 GAS)
Broad Institute
Curated by PubChem BioAssay
LigandPNGBDBM54859(5-ethyl-2-(2-thenoylamino)-4-(2-thienyl)thiophene-...)
Affinity DataEC50:  2.18E+4nM. Assay description: Keywords: Group A streptococcus, GAS, streptokinase, expression, virulence, inhibition, dose response, EC50 Assay Overview: The goal of this assa...
In DepthDetails PCBioAssay