BDBM54866 (4-methoxyphenyl)-[5-(4-methoxyphenyl)thieno[2,3-d]pyrimidin-4-yl]amine::BRD-K21328299-001-04-7::N,5-bis(4-methoxyphenyl)-4-thieno[2,3-d]pyrimidinamine::N,5-bis(4-methoxyphenyl)thieno[2,3-d]pyrimidin-4-amine::cid_1189431
SMILES COc1ccc(Nc2ncnc3scc(-c4ccc(OC)cc4)c23)cc1
InChI Key InChIKey=IBLVRWXMJGVKAV-UHFFFAOYSA-N
Data  2 EC50
  Tab Delimited (TSV)   2D SDfile   Computed 3D by Vconf -m prep SDfile
Find this compound or compounds like it in BindingDB:
Activity Spreadsheet -- Enzyme Inhibition Constant Data from BindingDB
Found 2 hits for monomerid = 54866
TargetStreptokinase A(Streptococcus pyogenes M1 GAS)
Broad Institute
Curated by PubChem BioAssay
LigandPNGBDBM54866((4-methoxyphenyl)-[5-(4-methoxyphenyl)thieno[2,3-d...)
Affinity DataEC50:  1.05E+4nM. Assay description: Keywords: Group A streptococcus, GAS, streptokinase, expression, virulence, inhibition, dose response, EC50 Assay Overview: The goal of this assa...
In DepthDetails PCBioAssay
TargetStreptokinase A(Streptococcus pyogenes M1 GAS)
Broad Institute
Curated by PubChem BioAssay
LigandPNGBDBM54866((4-methoxyphenyl)-[5-(4-methoxyphenyl)thieno[2,3-d...)
Affinity DataEC50:  5.70E+3nM. Assay description: Keywords: Group A streptococcus, GAS, streptokinase, expression, virulence, inhibition, dose response, EC50 Assay Overview: The goal of this assa...
In DepthDetails PCBioAssay