BDBM54873 4-(2,6-dichlorophenyl)sulfanyl-6-(methoxymethyl)-2-phenylpyrimidine::4-[(2,6-dichlorophenyl)thio]-6-(methoxymethyl)-2-phenyl-pyrimidine::4-[(2,6-dichlorophenyl)thio]-6-(methoxymethyl)-2-phenylpyrimidine::4-[2,6-bis(chloranyl)phenyl]sulfanyl-6-(methoxymethyl)-2-phenyl-pyrimidine::BRD-K39862507-001-04-3::cid_1476689
SMILES COCc1cc(Sc2c(Cl)cccc2Cl)nc(n1)-c1ccccc1
InChI Key InChIKey=SUVOXGWYLYOWHY-UHFFFAOYSA-N
Data  2 EC50
  Tab Delimited (TSV)   2D SDfile   Computed 3D by Vconf -m prep SDfile
Find this compound or compounds like it in BindingDB:
Activity Spreadsheet -- Enzyme Inhibition Constant Data from BindingDB
Found 2 hits for monomerid = 54873
TargetStreptokinase A(Streptococcus pyogenes M1 GAS)
Broad Institute
Curated by PubChem BioAssay
LigandPNGBDBM54873(4-(2,6-dichlorophenyl)sulfanyl-6-(methoxymethyl)-2...)
Affinity DataEC50:  9.31E+3nM. Assay description: Keywords: Group A streptococcus, GAS, streptokinase, expression, virulence, inhibition, dose response, EC50 Assay Overview: The goal of this assa...
In DepthDetails PCBioAssay
TargetStreptokinase A(Streptococcus pyogenes M1 GAS)
Broad Institute
Curated by PubChem BioAssay
LigandPNGBDBM54873(4-(2,6-dichlorophenyl)sulfanyl-6-(methoxymethyl)-2...)
Affinity DataEC50:  7.59E+3nM. Assay description: Keywords: Group A streptococcus, GAS, streptokinase, expression, virulence, inhibition, dose response, EC50 Assay Overview: The goal of this assa...
In DepthDetails PCBioAssay