BDBM54929 2,4-bis(bromanyl)-6-[[(4-fluorophenyl)amino]methyl]phenol::2,4-dibromo-6-[(4-fluoroanilino)methyl]benzenol::2,4-dibromo-6-[(4-fluoroanilino)methyl]phenol::MLS000755292::SMR000338169::cid_1491422
SMILES Oc1c(Br)cc(Br)cc1CNc1ccc(F)cc1
InChI Key InChIKey=RSAVHLHUQZXMTJ-UHFFFAOYSA-N
Data  2 IC50  1 EC50
  Tab Delimited (TSV)   2D SDfile   Computed 3D by Vconf -m prep SDfile
Find this compound or compounds like it in BindingDB:
Activity Spreadsheet -- Enzyme Inhibition Constant Data from BindingDB
Found 3 hits for monomerid = 54929
TargetPlectin(Homo sapiens (Human))
Burnham Center For Chemical Genomics
Curated by PubChem BioAssay
LigandPNGBDBM54929(2,4-bis(bromanyl)-6-[[(4-fluorophenyl)amino]methyl...)
Affinity DataIC50:  2.39E+4nM. Assay description: Data Source: Sanford-Burnham Center for Chemical Genomics (SBCCG) Source Affiliation: Sanford-Burnham Medical Research Institute (SBMRI, San Diego, C...
In DepthDetails PCBioAssay
TargetPlectin(Homo sapiens (Human))
Burnham Center For Chemical Genomics
Curated by PubChem BioAssay
LigandPNGBDBM54929(2,4-bis(bromanyl)-6-[[(4-fluorophenyl)amino]methyl...)
Affinity DataIC50:  2.00E+5nM. Assay description: Data Source: Sanford-Burnham Center for Chemical Genomics (SBCCG) Source Affiliation: Sanford-Burnham Medical Research Institute (SBMRI, San Diego, C...
In DepthDetails PCBioAssay
TargetStreptokinase A(Streptococcus pyogenes M1 GAS)
Broad Institute
Curated by PubChem BioAssay
LigandPNGBDBM54929(2,4-bis(bromanyl)-6-[[(4-fluorophenyl)amino]methyl...)
Affinity DataEC50:  8.44E+4nM. Assay description: Keywords: Group A streptococcus, GAS, streptokinase, expression, virulence, inhibition, dose response, EC50 Assay Overview: The goal of this assa...
In DepthDetails PCBioAssay